Build failure of network:osmocom:latest/openbsc in Debian_8.0/x86_64

OBS Notification admin at opensuse.org
Tue Mar 2 09:04:51 UTC 2021


Visit https://build.opensuse.org/package/live_build_log/network:osmocom:latest/openbsc/Debian_8.0/x86_64

Package network:osmocom:latest/openbsc failed to build in Debian_8.0/x86_64

Check out the package for editing:
  osc checkout network:osmocom:latest openbsc

Last lines of build log:
[  128s] | #define HAVE_STRING_H 1
[  128s] | #define HAVE_MEMORY_H 1
[  128s] | #define HAVE_STRINGS_H 1
[  128s] | #define HAVE_INTTYPES_H 1
[  128s] | #define HAVE_STDINT_H 1
[  128s] | #define HAVE_UNISTD_H 1
[  128s] | #define HAVE_DLFCN_H 1
[  128s] | #define LT_OBJDIR ".libs/"
[  128s] | #define BUILD_SMPP 1
[  128s] | #define STDC_HEADERS 1
[  128s] | #define HAVE_DBI_DBD_H 1
[  128s] | #define HAVE_PCAP_PCAP_H 1
[  128s] | #define HAVE_TM_GMTOFF_IN_TM 1
[  128s] | 
[  128s] | configure: exit 0
[  128s] 
[  128s] debian/rules:30: recipe for target 'override_dh_auto_test' failed
[  128s] make[1]: *** [override_dh_auto_test] Error 1
[  128s] make[1]: Leaving directory '/usr/src/packages/BUILD'
[  128s] debian/rules:13: recipe for target 'build' failed
[  128s] make: *** [build] Error 2
[  128s] dpkg-buildpackage: error: debian/rules build gave error exit status 2
[  128s] ### VM INTERACTION START ###
[  129s] Powering off.
[  129s] [  121.136219] reboot: Power down
[  129s] ### VM INTERACTION END ###
[  129s] 
[  129s] lamb25 failed "build openbsc_1.3.2.dsc" at Tue Mar  2 09:04:38 UTC 2021.
[  129s] 

-- 
Configure notifications at https://build.opensuse.org/my/subscriptions
openSUSE Build Service (https://build.opensuse.org/)


More information about the gerrit-log mailing list