Build failure of network:osmocom:nightly/osmo-bsc in Debian_9.0/x86_64

OBS Notification noreply at opensuse.org
Mon Jun 7 00:45:00 UTC 2021


Visit https://build.opensuse.org/package/live_build_log/network:osmocom:nightly/osmo-bsc/Debian_9.0/x86_64

Package network:osmocom:nightly/osmo-bsc failed to build in Debian_9.0/x86_64

Check out the package for editing:
  osc checkout network:osmocom:nightly osmo-bsc

Last lines of build log:
[  221s] libtool: link: gcc -pthread -I/usr/include/ -I/usr/include/ -I/usr/include/ -g -O2 -fdebug-prefix-map=/usr/src/packages/BUILD=. -fstack-protector-strong -Wformat -Werror=format-security -std=gnu11 -Werror=implicit -Werror=maybe-uninitialized -Werror=memset-transposed-args -Wnull-dereference -Werror=sizeof-array-argument -Werror=sizeof-pointer-memaccess -Wl,-z -Wl,relro -o meas_json meas_json-meas_json.o ../../src/osmo-bsc/abis_nm.o ../../src/osmo-bsc/acc.o ../../src/osmo-bsc/bts.o ../../src/osmo-bsc/bts_sm.o ../../src/osmo-bsc/bts_ipaccess_nanobts_omlattr.o ../../src/osmo-bsc/bts_trx.o ../../src/osmo-bsc/gsm_data.o ../../src/osmo-bsc/nm_common_fsm.o ../../src/osmo-bsc/nm_bts_sm_fsm.o ../../src/osmo-bsc/nm_bts_fsm.o ../../src/osmo-bsc/nm_bb_transc_fsm.o ../../src/osmo-bsc/nm_channel_fsm.o ../../src/osmo-bsc/nm_gprs_cell_fsm.o ../../src/osmo-bsc/nm_gprs_nse_fsm.o ../../src/osmo-bsc/nm_gprs_nsvc_fsm.o ../../src/osmo-bsc/nm_rcarrier_fsm.o  -ltalloc /usr/lib/x86_64-linux-gnu/libosmogsm.so /usr/lib/x86_64-linux-gnu/libosmocore.so /usr/lib/x86_64-linux-gnu/libosmoabis.so -pthread
[  221s] gcc -DHAVE_CONFIG_H -I. -I../..   -I../../include -I../..  -Wdate-time -D_FORTIFY_SOURCE=2 -pthread -I/usr/include/ -I/usr/include/  -g -O2 -fdebug-prefix-map=/usr/src/packages/BUILD=. -fstack-protector-strong -Wformat -Werror=format-security -std=gnu11 -Werror=implicit -Werror=maybe-uninitialized -Werror=memset-transposed-args -Wnull-dereference -Werror=sizeof-array-argument -Werror=sizeof-pointer-memaccess -c -o meas_vis-meas_vis.o `test -f 'meas_vis.c' || echo './'`meas_vis.c
[  221s] meas_vis.c: In function 'write_uni':
[  221s] meas_vis.c:196:15: error: 'struct gsm_meas_rep' has no member named 'bs_power'; did you mean 'bs_power_db'?
[  221s]    pwr = ms->mr.bs_power;
[  221s]                ^
[  221s] Makefile:723: recipe for target 'meas_vis-meas_vis.o' failed
[  221s] make[4]: *** [meas_vis-meas_vis.o] Error 1
[  221s] make[4]: Leaving directory '/usr/src/packages/BUILD/src/utils'
[  221s] Makefile:403: recipe for target 'all-recursive' failed
[  221s] make[3]: *** [all-recursive] Error 1
[  221s] make[3]: Leaving directory '/usr/src/packages/BUILD/src'
[  221s] Makefile:453: recipe for target 'all-recursive' failed
[  221s] make[2]: *** [all-recursive] Error 1
[  221s] make[2]: Leaving directory '/usr/src/packages/BUILD'
[  221s] Makefile:385: recipe for target 'all' failed
[  221s] make[1]: *** [all] Error 2
[  221s] make[1]: Leaving directory '/usr/src/packages/BUILD'
[  221s] dh_auto_build: make -j1 returned exit code 2
[  221s] debian/rules:45: recipe for target 'build' failed
[  221s] make: *** [build] Error 2
[  221s] dpkg-buildpackage: error: debian/rules build gave error exit status 2
[  221s] ### VM INTERACTION START ###
[  224s] [  212.476968] sysrq: Power Off
[  224s] [  212.485190] reboot: Power down
[  224s] ### VM INTERACTION END ###
[  225s] 
[  225s] lamb57 failed "build osmo-bsc_1.7.0.108.4d5604.202106070026.dsc" at Mon Jun  7 00:44:44 UTC 2021.
[  225s] 

-- 
Configure notifications at https://build.opensuse.org/my/subscriptions
openSUSE Build Service (https://build.opensuse.org/)


More information about the gerrit-log mailing list