Build failure of network:osmocom:nightly/osmo-bsc in Debian_10/x86_64

OBS Notification noreply at opensuse.org
Sun Jun 6 00:57:23 UTC 2021


Visit https://build.opensuse.org/package/live_build_log/network:osmocom:nightly/osmo-bsc/Debian_10/x86_64

Package network:osmocom:nightly/osmo-bsc failed to build in Debian_10/x86_64

Check out the package for editing:
  osc checkout network:osmocom:nightly osmo-bsc

Last lines of build log:
[  305s] /bin/bash ../../libtool  --tag=CC   --mode=link gcc -Wall -pthread -I/usr/include/ -I/usr/include/ -I/usr/include/    -g -O2 -fdebug-prefix-map=/usr/src/packages/BUILD=. -fstack-protector-strong -Wformat -Werror=format-security -std=gnu11 -Werror=implicit -Werror=maybe-uninitialized -Werror=memset-transposed-args -Wnull-dereference -Werror=sizeof-array-argument -Werror=sizeof-pointer-memaccess   -Wl,-z,relro -o isdnsync isdnsync.o  
[  306s] libtool: link: gcc -Wall -pthread -I/usr/include/ -I/usr/include/ -I/usr/include/ -g -O2 -fdebug-prefix-map=/usr/src/packages/BUILD=. -fstack-protector-strong -Wformat -Werror=format-security -std=gnu11 -Werror=implicit -Werror=maybe-uninitialized -Werror=memset-transposed-args -Wnull-dereference -Werror=sizeof-array-argument -Werror=sizeof-pointer-memaccess -Wl,-z -Wl,relro -o isdnsync isdnsync.o  -pthread
[  306s] gcc -DHAVE_CONFIG_H -I. -I../..   -I../../include -I../..  -Wdate-time -D_FORTIFY_SOURCE=2 -pthread -I/usr/include/ -I/usr/include/ -I/usr/include/  -g -O2 -fdebug-prefix-map=/usr/src/packages/BUILD=. -fstack-protector-strong -Wformat -Werror=format-security -std=gnu11 -Werror=implicit -Werror=maybe-uninitialized -Werror=memset-transposed-args -Wnull-dereference -Werror=sizeof-array-argument -Werror=sizeof-pointer-memaccess -c -o meas_json-meas_json.o `test -f 'meas_json.c' || echo './'`meas_json.c
[  306s] /bin/bash ../../libtool  --tag=CC   --mode=link gcc -pthread -I/usr/include/ -I/usr/include/ -I/usr/include/  -g -O2 -fdebug-prefix-map=/usr/src/packages/BUILD=. -fstack-protector-strong -Wformat -Werror=format-security -std=gnu11 -Werror=implicit -Werror=maybe-uninitialized -Werror=memset-transposed-args -Wnull-dereference -Werror=sizeof-array-argument -Werror=sizeof-pointer-memaccess   -Wl,-z,relro -o meas_json meas_json-meas_json.o ../../src/osmo-bsc/abis_nm.o ../../src/osmo-bsc/acc.o ../../src/osmo-bsc/bts.o ../../src/osmo-bsc/bts_sm.o ../../src/osmo-bsc/bts_ipaccess_nanobts_omlattr.o ../../src/osmo-bsc/bts_trx.o ../../src/osmo-bsc/gsm_data.o ../../src/osmo-bsc/nm_common_fsm.o ../../src/osmo-bsc/nm_bts_sm_fsm.o ../../src/osmo-bsc/nm_bts_fsm.o ../../src/osmo-bsc/nm_bb_transc_fsm.o ../../src/osmo-bsc/nm_channel_fsm.o ../../src/osmo-bsc/nm_gprs_cell_fsm.o ../../src/osmo-bsc/nm_gprs_nse_fsm.o ../../src/osmo-bsc/nm_gprs_nsvc_fsm.o ../../src/osmo-bsc/nm_rcarrier_fsm.o -ltalloc -losmocore -ltalloc -losmogsm -losmocore -losmoabis  
[  306s] libtool: link: gcc -pthread -I/usr/include/ -I/usr/include/ -I/usr/include/ -g -O2 -fdebug-prefix-map=/usr/src/packages/BUILD=. -fstack-protector-strong -Wformat -Werror=format-security -std=gnu11 -Werror=implicit -Werror=maybe-uninitialized -Werror=memset-transposed-args -Wnull-dereference -Werror=sizeof-array-argument -Werror=sizeof-pointer-memaccess -Wl,-z -Wl,relro -o meas_json meas_json-meas_json.o ../../src/osmo-bsc/abis_nm.o ../../src/osmo-bsc/acc.o ../../src/osmo-bsc/bts.o ../../src/osmo-bsc/bts_sm.o ../../src/osmo-bsc/bts_ipaccess_nanobts_omlattr.o ../../src/osmo-bsc/bts_trx.o ../../src/osmo-bsc/gsm_data.o ../../src/osmo-bsc/nm_common_fsm.o ../../src/osmo-bsc/nm_bts_sm_fsm.o ../../src/osmo-bsc/nm_bts_fsm.o ../../src/osmo-bsc/nm_bb_transc_fsm.o ../../src/osmo-bsc/nm_channel_fsm.o ../../src/osmo-bsc/nm_gprs_cell_fsm.o ../../src/osmo-bsc/nm_gprs_nse_fsm.o ../../src/osmo-bsc/nm_gprs_nsvc_fsm.o ../../src/osmo-bsc/nm_rcarrier_fsm.o  -ltalloc /usr/lib/x86_64-linux-gnu/libosmogsm.so /usr/lib/x86_64-linux-gnu/libosmocore.so /usr/lib/x86_64-linux-gnu/libosmoabis.so -pthread
[  306s] gcc -DHAVE_CONFIG_H -I. -I../..   -I../../include -I../..  -Wdate-time -D_FORTIFY_SOURCE=2 -pthread -I/usr/include/ -I/usr/include/  -g -O2 -fdebug-prefix-map=/usr/src/packages/BUILD=. -fstack-protector-strong -Wformat -Werror=format-security -std=gnu11 -Werror=implicit -Werror=maybe-uninitialized -Werror=memset-transposed-args -Wnull-dereference -Werror=sizeof-array-argument -Werror=sizeof-pointer-memaccess -c -o meas_vis-meas_vis.o `test -f 'meas_vis.c' || echo './'`meas_vis.c
[  306s] meas_vis.c: In function 'write_uni':
[  306s] meas_vis.c:196:16: error: 'struct gsm_meas_rep' has no member named 'bs_power'; did you mean 'bs_power_db'?
[  306s]    pwr = ms->mr.bs_power;
[  306s]                 ^~~~~~~~
[  306s]                 bs_power_db
[  306s] make[4]: *** [Makefile:736: meas_vis-meas_vis.o] Error 1
[  306s] make[4]: Leaving directory '/usr/src/packages/BUILD/src/utils'
[  306s] make[3]: *** [Makefile:403: all-recursive] Error 1
[  306s] make[3]: Leaving directory '/usr/src/packages/BUILD/src'
[  306s] make[2]: *** [Makefile:453: all-recursive] Error 1
[  306s] make[2]: Leaving directory '/usr/src/packages/BUILD'
[  306s] make[1]: *** [Makefile:385: all] Error 2
[  306s] make[1]: Leaving directory '/usr/src/packages/BUILD'
[  306s] dh_auto_build: make -j1 returned exit code 2
[  306s] make: *** [debian/rules:45: build] Error 2
[  306s] dpkg-buildpackage: error: debian/rules build subprocess returned exit status 2
[  306s] ### VM INTERACTION START ###
[  309s] [  294.157193] sysrq: Power Off
[  309s] [  294.163518] reboot: Power down
[  309s] ### VM INTERACTION END ###
[  309s] 
[  309s] lamb17 failed "build osmo-bsc_1.7.0.108.4d5604.202106060026.dsc" at Sun Jun  6 00:57:10 UTC 2021.
[  309s] 

-- 
Configure notifications at https://build.opensuse.org/my/subscriptions
openSUSE Build Service (https://build.opensuse.org/)


More information about the gerrit-log mailing list