Build failure of network:osmocom:nightly/osmo-bsc in Debian_Testing/x86_64

OBS Notification noreply at opensuse.org
Mon Jul 12 04:24:17 UTC 2021


Visit https://build.opensuse.org/package/live_build_log/network:osmocom:nightly/osmo-bsc/Debian_Testing/x86_64

Package network:osmocom:nightly/osmo-bsc failed to build in Debian_Testing/x86_64

Check out the package for editing:
  osc checkout network:osmocom:nightly osmo-bsc

Last lines of build log:
[  318s] /bin/bash ../../libtool  --tag=CC   --mode=link gcc -Wall -pthread -I/usr/include/ -I/usr/include/ -I/usr/include/  -g -O2 -ffile-prefix-map=/usr/src/packages/BUILD=. -fstack-protector-strong -Wformat -Werror=format-security -std=gnu11 -Werror=implicit -Werror=maybe-uninitialized -Werror=memset-transposed-args -Wnull-dereference -Werror=sizeof-array-argument -Werror=sizeof-pointer-memaccess  -Wl,-z,relro -o nanobts_omlattr_test nanobts_omlattr_test.o ../../src/osmo-bsc/abis_nm.o ../../src/osmo-bsc/abis_osmo.o ../../src/osmo-bsc/acc.o ../../src/osmo-bsc/bts_ipaccess_nanobts_omlattr.o ../../src/osmo-bsc/bts.o ../../src/osmo-bsc/bts_sm.o ../../src/osmo-bsc/bts_trx.o ../../src/osmo-bsc/gsm_data.o ../../src/osmo-bsc/nm_common_fsm.o ../../src/osmo-bsc/nm_bts_sm_fsm.o ../../src/osmo-bsc/nm_bts_fsm.o ../../src/osmo-bsc/nm_bb_transc_fsm.o ../../src/osmo-bsc/nm_channel_fsm.o ../../src/osmo-bsc/nm_gprs_cell_fsm.o ../../src/osmo-bsc/nm_gprs_nse_fsm.o ../../src/osmo-bsc/nm_gprs_nsvc_fsm.o ../../src/osmo-bsc/nm_rcarrier_fsm.o -ltalloc -losmocore -ltalloc -losmogsm -losmocore -losmoabis  
[  318s] libtool: link: gcc -Wall -pthread -I/usr/include/ -I/usr/include/ -I/usr/include/ -g -O2 -ffile-prefix-map=/usr/src/packages/BUILD=. -fstack-protector-strong -Wformat -Werror=format-security -std=gnu11 -Werror=implicit -Werror=maybe-uninitialized -Werror=memset-transposed-args -Wnull-dereference -Werror=sizeof-array-argument -Werror=sizeof-pointer-memaccess -Wl,-z -Wl,relro -o nanobts_omlattr_test nanobts_omlattr_test.o ../../src/osmo-bsc/abis_nm.o ../../src/osmo-bsc/abis_osmo.o ../../src/osmo-bsc/acc.o ../../src/osmo-bsc/bts_ipaccess_nanobts_omlattr.o ../../src/osmo-bsc/bts.o ../../src/osmo-bsc/bts_sm.o ../../src/osmo-bsc/bts_trx.o ../../src/osmo-bsc/gsm_data.o ../../src/osmo-bsc/nm_common_fsm.o ../../src/osmo-bsc/nm_bts_sm_fsm.o ../../src/osmo-bsc/nm_bts_fsm.o ../../src/osmo-bsc/nm_bb_transc_fsm.o ../../src/osmo-bsc/nm_channel_fsm.o ../../src/osmo-bsc/nm_gprs_cell_fsm.o ../../src/osmo-bsc/nm_gprs_nse_fsm.o ../../src/osmo-bsc/nm_gprs_nsvc_fsm.o ../../src/osmo-bsc/nm_rcarrier_fsm.o  -ltalloc /usr/lib/x86_64-linux-gnu/libosmogsm.so /usr/lib/x86_64-linux-gnu/libosmocore.so /usr/lib/x86_64-linux-gnu/libosmoabis.so -pthread
[  318s] make[4]: Leaving directory '/usr/src/packages/BUILD/tests/nanobts_omlattr'
[  318s] Making all in handover
[  318s] make[4]: Entering directory '/usr/src/packages/BUILD/tests/handover'
[  318s] gcc -DHAVE_CONFIG_H -I. -I../..   -I../../include  -Wdate-time -D_FORTIFY_SOURCE=2 -Wall -ggdb3 -pthread -I/usr/include/ -I/usr/include/ -I/usr/include/ -I/usr/include/ -I/usr/include/ -I/usr/include/ -I/usr/include/ -I/usr/include/  -g -O2 -ffile-prefix-map=/usr/src/packages/BUILD=. -fstack-protector-strong -Wformat -Werror=format-security -std=gnu11 -Werror=implicit -Werror=maybe-uninitialized -Werror=memset-transposed-args -Wnull-dereference -Werror=sizeof-array-argument -Werror=sizeof-pointer-memaccess -c -o handover_test.o handover_test.c
[  318s] handover_test.c: In function 'res_ind':
[  318s] handover_test.c:1094:30: error: 'ts_str' may be used uninitialized in this function [-Werror=maybe-uninitialized]
[  318s]  1094 |     char subslot_val = ts_str[lchan->nr];
[  318s]       |                              ^
[  318s] cc1: some warnings being treated as errors
[  318s] make[4]: *** [Makefile:576: handover_test.o] Error 1
[  318s] make[4]: Leaving directory '/usr/src/packages/BUILD/tests/handover'
[  318s] make[3]: *** [Makefile:420: all-recursive] Error 1
[  318s] make[3]: Leaving directory '/usr/src/packages/BUILD/tests'
[  318s] make[2]: *** [Makefile:455: all-recursive] Error 1
[  318s] make[2]: Leaving directory '/usr/src/packages/BUILD'
[  318s] make[1]: *** [Makefile:387: all] Error 2
[  318s] make[1]: Leaving directory '/usr/src/packages/BUILD'
[  318s] dh_auto_build: error: make -j1 returned exit code 2
[  318s] make: *** [debian/rules:45: build] Error 25
[  318s] dpkg-buildpackage: error: debian/rules build subprocess returned exit status 2
[  318s] ### VM INTERACTION START ###
[  319s] Powering off.
[  319s] [  301.545495] reboot: Power down
[  319s] ### VM INTERACTION END ###
[  319s] 
[  319s] goat11 failed "build osmo-bsc_1.7.0.190.5ac70.202107120026.dsc" at Mon Jul 12 04:24:09 UTC 2021.
[  319s] 

-- 
Configure notifications at https://build.opensuse.org/my/subscriptions
openSUSE Build Service (https://build.opensuse.org/)


More information about the gerrit-log mailing list