Build failure of network:osmocom:nightly/osmo-bsc in openSUSE_Leap_15.1_ARM/aarch64

OBS Notification noreply at opensuse.org
Mon Jul 12 02:41:25 UTC 2021


Visit https://build.opensuse.org/package/live_build_log/network:osmocom:nightly/osmo-bsc/openSUSE_Leap_15.1_ARM/aarch64

Package network:osmocom:nightly/osmo-bsc failed to build in openSUSE_Leap_15.1_ARM/aarch64

Check out the package for editing:
  osc checkout network:osmocom:nightly osmo-bsc

Last lines of build log:
[  102s]   CCLD     nanobts_omlattr_test
[  102s] make[3]: Leaving directory '/home/abuild/rpmbuild/BUILD/osmo-bsc-1.7.0.190.5ac70.202107120026/tests/nanobts_omlattr'
[  102s] Making all in handover
[  102s] make[3]: Entering directory '/home/abuild/rpmbuild/BUILD/osmo-bsc-1.7.0.190.5ac70.202107120026/tests/handover'
[  102s]   CC       handover_test.o
[  104s] handover_test.c: In function 'res_ind':
[  104s] handover_test.c:1094:30: error: 'ts_str' may be used uninitialized in this function [-Werror=maybe-uninitialized]
[  104s]      char subslot_val = ts_str[lchan->nr];
[  104s]                               ^
[  104s] cc1: some warnings being treated as errors
[  104s] make[3]: *** [Makefile:568: handover_test.o] Error 1
[  104s] make[3]: Leaving directory '/home/abuild/rpmbuild/BUILD/osmo-bsc-1.7.0.190.5ac70.202107120026/tests/handover'
[  104s] make[2]: *** [Makefile:419: all-recursive] Error 1
[  104s] make[2]: Leaving directory '/home/abuild/rpmbuild/BUILD/osmo-bsc-1.7.0.190.5ac70.202107120026/tests'
[  104s] make[1]: *** [Makefile:452: all-recursive] Error 1
[  104s] make[1]: Leaving directory '/home/abuild/rpmbuild/BUILD/osmo-bsc-1.7.0.190.5ac70.202107120026'
[  104s] make: *** [Makefile:384: all] Error 2
[  104s] error: Bad exit status from /var/tmp/rpm-tmp.8sBxUu (%build)
[  104s] 
[  104s] 
[  104s] RPM build errors:
[  104s]     Bad exit status from /var/tmp/rpm-tmp.8sBxUu (%build)
[  104s] ### VM INTERACTION START ###
[  107s] [   93.333359] sysrq: SysRq : Power Off
[  107s] [   93.407205] reboot: Power down
[  107s] ### VM INTERACTION END ###
[  107s] 
[  107s] obs-arm-9 failed "build osmo-bsc.spec" at Mon Jul 12 02:41:08 UTC 2021.
[  107s] 

-- 
Configure notifications at https://build.opensuse.org/my/subscriptions
openSUSE Build Service (https://build.opensuse.org/)


More information about the gerrit-log mailing list