Build failure of network:osmocom:nightly/osmo-bsc in openSUSE_Leap_15.1/x86_64

OBS Notification noreply at opensuse.org
Mon Jul 12 01:12:22 UTC 2021


Visit https://build.opensuse.org/package/live_build_log/network:osmocom:nightly/osmo-bsc/openSUSE_Leap_15.1/x86_64

Package network:osmocom:nightly/osmo-bsc failed to build in openSUSE_Leap_15.1/x86_64

Check out the package for editing:
  osc checkout network:osmocom:nightly osmo-bsc

Last lines of build log:
[   51s]   CCLD     nanobts_omlattr_test
[   52s] make[3]: Leaving directory '/home/abuild/rpmbuild/BUILD/osmo-bsc-1.7.0.190.5ac70.202107120026/tests/nanobts_omlattr'
[   52s] Making all in handover
[   52s] make[3]: Entering directory '/home/abuild/rpmbuild/BUILD/osmo-bsc-1.7.0.190.5ac70.202107120026/tests/handover'
[   52s]   CC       handover_test.o
[   52s] handover_test.c: In function 'res_ind':
[   52s] handover_test.c:1094:30: error: 'ts_str' may be used uninitialized in this function [-Werror=maybe-uninitialized]
[   52s]      char subslot_val = ts_str[lchan->nr];
[   52s]                               ^
[   52s] cc1: some warnings being treated as errors
[   52s] make[3]: *** [Makefile:568: handover_test.o] Error 1
[   52s] make[3]: Leaving directory '/home/abuild/rpmbuild/BUILD/osmo-bsc-1.7.0.190.5ac70.202107120026/tests/handover'
[   52s] make[2]: *** [Makefile:419: all-recursive] Error 1
[   52s] make[2]: Leaving directory '/home/abuild/rpmbuild/BUILD/osmo-bsc-1.7.0.190.5ac70.202107120026/tests'
[   52s] make[1]: *** [Makefile:452: all-recursive] Error 1
[   52s] make[1]: Leaving directory '/home/abuild/rpmbuild/BUILD/osmo-bsc-1.7.0.190.5ac70.202107120026'
[   52s] make: *** [Makefile:384: all] Error 2
[   52s] error: Bad exit status from /var/tmp/rpm-tmp.68SOuI (%build)
[   52s] 
[   52s] 
[   52s] RPM build errors:
[   52s]     Bad exit status from /var/tmp/rpm-tmp.68SOuI (%build)
[   52s] ### VM INTERACTION START ###
[   56s] [   47.161437] sysrq: SysRq : Power Off
[   56s] [   47.164800] reboot: Power down
[   56s] ### VM INTERACTION END ###
[   56s] 
[   56s] sheep88 failed "build osmo-bsc.spec" at Mon Jul 12 01:12:21 UTC 2021.
[   56s] 

-- 
Configure notifications at https://build.opensuse.org/my/subscriptions
openSUSE Build Service (https://build.opensuse.org/)


More information about the gerrit-log mailing list