Build failure of network:osmocom:nightly/simtrace2 in Debian_9.0/x86_64

OBS Notification admin at opensuse.org
Tue Apr 6 01:33:54 UTC 2021


Visit https://build.opensuse.org/package/live_build_log/network:osmocom:nightly/simtrace2/Debian_9.0/x86_64

Package network:osmocom:nightly/simtrace2 failed to build in Debian_9.0/x86_64

Check out the package for editing:
  osc checkout network:osmocom:nightly simtrace2

Last lines of build log:
[  108s] [COMPILING ./atmel_softpack_libraries/usb/device/dfu/dfu_driver.c]
[  108s] Memory region         Used Size  Region Size  %age Used
[  108s]              rom:       16400 B        16 KB    100.10%
[  108s]              ram:       11688 B        48 KB     23.78/usr/lib/gcc/arm-none-eabi/5.4.1/../../../arm-none-eabi/bin/ld: warning: changing start of section .stack by 4 bytes
[  108s] /usr/lib/gcc/arm-none-eabi/5.4.1/../../../arm-none-eabi/bin/ld: warning: changing start of section .stack by 4 bytes
[  109s] /usr/lib/gcc/arm-none-eabi/5.4.1/../../../arm-none-eabi/bin/ld: bin/qmod-dfu-flash.elf section `.text' will not fit in region `rom'
[  109s] /usr/lib/gcc/arm-none-eabi/5.4.1/../../../arm-none-eabi/bin/ld: warning: changing start of section .stack by 4 bytes
[  109s] /usr/lib/gcc/arm-none-eabi/5.4.1/../../../arm-none-eabi/bin/ld: warning: changing start of section .stack by 4 bytes
[  109s] /usr/lib/gcc/arm-none-eabi/5.4.1/../../../arm-none-eabi/bin/ld: warning: changing start of section .stack by 4 bytes
[  109s] /usr/lib/gcc/arm-none-eabi/5.4.1/../../../arm-none-eabi/bin/ld: region `rom' overflowed by 16 bytes
[  109s] collect2: error: ld returned 1 exit status
[  109s] %
[  109s] Makefile:238: recipe for target 'flash' failed
[  109s] make[2]: *** [flash] Error 1
[  109s] make[2]: Leaving directory '/usr/src/packages/BUILD/firmware'
[  109s] Makefile:13: recipe for target 'fw-qmod-dfu' failed
[  109s] make[1]: *** [fw-qmod-dfu] Error 2
[  109s] make[1]: Leaving directory '/usr/src/packages/BUILD'
[  109s] dh_auto_build: make -j1 returned exit code 2
[  109s] debian/rules:16: recipe for target 'build' failed
[  109s] make: *** [build] Error 2
[  109s] dpkg-buildpackage: error: debian/rules build gave error exit status 2
[  109s] ### VM INTERACTION START ###
[  112s] [   96.425958] sysrq: Power Off
[  112s] [   96.433081] reboot: Power down
[  112s] ### VM INTERACTION END ###
[  112s] 
[  112s] cloud137 failed "build simtrace2_0.7.0.88.7a3d.dsc" at Tue Apr  6 01:33:48 UTC 2021.
[  112s] 

-- 
Configure notifications at https://build.opensuse.org/my/subscriptions
openSUSE Build Service (https://build.opensuse.org/)


More information about the gerrit-log mailing list