Build failure of network:osmocom:nightly/simtrace2 in Debian_9.0/i586

OBS Notification admin at opensuse.org
Tue Apr 6 01:33:37 UTC 2021


Visit https://build.opensuse.org/package/live_build_log/network:osmocom:nightly/simtrace2/Debian_9.0/i586

Package network:osmocom:nightly/simtrace2 failed to build in Debian_9.0/i586

Check out the package for editing:
  osc checkout network:osmocom:nightly simtrace2

Last lines of build log:
[  100s] [COMPILING ./atmel_softpack_libraries/usb/device/dfu/dfu_driver.c]
[  101s] Memory region         Used Size  Region Size  %age Used
[  101s]              rom:       16400 B        16 KB    100.10%
[  101s]              ram:       11688 B        48 KB     23.78/usr/lib/gcc/arm-none-eabi/5.4.1/../../../arm-none-eabi/bin/ld: warning: changing start of section .stack by 4 bytes
[  101s] /usr/lib/gcc/arm-none-eabi/5.4.1/../../../arm-none-eabi/bin/ld: warning: changing start of section .stack by 4 bytes
[  101s] /usr/lib/gcc/arm-none-eabi/5.4.1/../../../arm-none-eabi/bin/ld: bin/qmod-dfu-flash.elf section `.text' will not fit in region `rom'
[  101s] /usr/lib/gcc/arm-none-eabi/5.4.1/../../../arm-none-eabi/bin/ld: warning: changing start of section .stack by 4 bytes
[  101s] /usr/lib/gcc/arm-none-eabi/5.4.1/../../../arm-none-eabi/bin/ld: warning: changing start of section .stack by 4 bytes
[  101s] /usr/lib/gcc/arm-none-eabi/5.4.1/../../../arm-none-eabi/bin/ld: warning: changing start of section .stack by 4 bytes
[  101s] /usr/lib/gcc/arm-none-eabi/5.4.1/../../../arm-none-eabi/bin/ld: region `rom' overflowed by 16 bytes
[  101s] collect2: error: ld returned 1 exit status
[  101s] %
[  101s] Makefile:238: recipe for target 'flash' failed
[  101s] make[2]: *** [flash] Error 1
[  101s] make[2]: Leaving directory '/usr/src/packages/BUILD/firmware'
[  101s] Makefile:13: recipe for target 'fw-qmod-dfu' failed
[  101s] make[1]: *** [fw-qmod-dfu] Error 2
[  101s] make[1]: Leaving directory '/usr/src/packages/BUILD'
[  101s] dh_auto_build: make -j1 returned exit code 2
[  101s] debian/rules:16: recipe for target 'build' failed
[  101s] make: *** [build] Error 2
[  101s] dpkg-buildpackage: error: debian/rules build gave error exit status 2
[  101s] ### VM INTERACTION START ###
[  104s] [   94.886149] sysrq: Power Off
[  104s] [   94.893591] reboot: Power down
[  104s] ### VM INTERACTION END ###
[  104s] 
[  104s] lamb52 failed "build simtrace2_0.7.0.88.7a3d.dsc" at Tue Apr  6 01:33:31 UTC 2021.
[  104s] 

-- 
Configure notifications at https://build.opensuse.org/my/subscriptions
openSUSE Build Service (https://build.opensuse.org/)


More information about the gerrit-log mailing list