Build failure of network:osmocom:nightly/simtrace2 in xUbuntu_20.04/x86_64

OBS Notification admin at opensuse.org
Mon Apr 5 02:23:15 UTC 2021


Visit https://build.opensuse.org/package/live_build_log/network:osmocom:nightly/simtrace2/xUbuntu_20.04/x86_64

Package network:osmocom:nightly/simtrace2 failed to build in xUbuntu_20.04/x86_64

Check out the package for editing:
  osc checkout network:osmocom:nightly simtrace2

Last lines of build log:
[  175s] [COMPILING apps/dfu/main.c]
[  175s] [COMPILING ./atmel_softpack_libraries/usb/device/dfu/dfu.c]
[  175s] [COMPILING ./atmel_softpack_libraries/usb/device/dfu/dfu_desc.c]
[  175s] [COMPILING ./atmel_softpack_libraries/usb/device/dfu/dfu_driver.c]
[  175s] Memory region         Used Size  Region Size  %age Used
[  176s]              rom:       16628 B        16 KB    101.49%
[  176s]              ram:       11688 B        48 KB     23.78/usr/lib/gcc/arm-none-eabi/9.2.1/../../../arm-none-eabi/bin/ld: warning: changing start of section .stack by 4 bytes
[  176s] /usr/lib/gcc/arm-none-eabi/9.2.1/../../../arm-none-eabi/bin/ld: warning: changing start of section .stack by 4 bytes
[  176s] /usr/lib/gcc/arm-none-eabi/9.2.1/../../../arm-none-eabi/bin/ld: bin/qmod-dfu-flash.elf section `.text' will not fit in region `rom'
[  176s] /usr/lib/gcc/arm-none-eabi/9.2.1/../../../arm-none-eabi/bin/ld: warning: changing start of section .stack by 4 bytes
[  176s] /usr/lib/gcc/arm-none-eabi/9.2.1/../../../arm-none-eabi/bin/ld: warning: changing start of section .stack by 4 bytes
[  176s] /usr/lib/gcc/arm-none-eabi/9.2.1/../../../arm-none-eabi/bin/ld: warning: changing start of section .stack by 4 bytes
[  176s] /usr/lib/gcc/arm-none-eabi/9.2.1/../../../arm-none-eabi/bin/ld: region `rom' overflowed by 244 bytes
[  176s] collect2: error: ld returned 1 exit status
[  176s] %
[  176s] make[2]: *** [Makefile:238: flash] Error 1
[  176s] make[2]: Leaving directory '/usr/src/packages/BUILD/firmware'
[  176s] make[1]: *** [Makefile:13: fw-qmod-dfu] Error 2
[  176s] make[1]: Leaving directory '/usr/src/packages/BUILD'
[  176s] dh_auto_build: error: make -j1 returned exit code 2
[  176s] make: *** [debian/rules:16: build] Error 25
[  176s] dpkg-buildpackage: error: debian/rules build subprocess returned exit status 2
[  176s] ### VM INTERACTION START ###
[  179s] [  163.573361] sysrq: Power Off
[  179s] [  163.586364] reboot: Power down
[  179s] ### VM INTERACTION END ###
[  179s] 
[  179s] sheep81 failed "build simtrace2_0.7.0.85.b218.dsc" at Mon Apr  5 02:23:01 UTC 2021.
[  179s] 

-- 
Configure notifications at https://build.opensuse.org/my/subscriptions
openSUSE Build Service (https://build.opensuse.org/)


More information about the gerrit-log mailing list