Build failure of network:osmocom:nightly/simtrace2 in xUbuntu_20.10/x86_64

OBS Notification admin at opensuse.org
Mon Apr 5 02:13:37 UTC 2021


Visit https://build.opensuse.org/package/live_build_log/network:osmocom:nightly/simtrace2/xUbuntu_20.10/x86_64

Package network:osmocom:nightly/simtrace2 failed to build in xUbuntu_20.10/x86_64

Check out the package for editing:
  osc checkout network:osmocom:nightly simtrace2

Last lines of build log:
[  685s] [COMPILING libboard/qmod/source/board_qmod.c]
[  685s] [COMPILING libboard/qmod/source/card_pres.c]
[  685s] [COMPILING libboard/qmod/source/i2c.c]
[  686s] [COMPILING libboard/qmod/source/wwan_led.c]
[  686s] [COMPILING libboard/qmod/source/wwan_perst.c]
[  686s] [COMPILING apps/dfu/main.c]
[  687s] [COMPILING ./atmel_softpack_libraries/usb/device/dfu/dfu.c]
[  687s] [COMPILING ./atmel_softpack_libraries/usb/device/dfu/dfu_desc.c]
[  687s] [COMPILING ./atmel_softpack_libraries/usb/device/dfu/dfu_driver.c]
[  688s] Memory region         Used Size  Region Size  %age Used
[  688s]              rom:       16628 B        16 KB    101.49%
[  688s]              ram:       11680 B        48 KB     23.76/usr/lib/gcc/arm-none-eabi/9.2.1/../../../arm-none-eabi/bin/ld: bin/qmod-dfu-flash.elf section `.text' will not fit in region `rom'
[  688s] /usr/lib/gcc/arm-none-eabi/9.2.1/../../../arm-none-eabi/bin/ld: region `rom' overflowed by 244 bytes
[  688s] collect2: error: ld returned 1 exit status
[  688s] %
[  688s] make[2]: *** [Makefile:238: flash] Error 1
[  688s] make[2]: Leaving directory '/usr/src/packages/BUILD/firmware'
[  688s] make[1]: *** [Makefile:13: fw-qmod-dfu] Error 2
[  688s] make[1]: Leaving directory '/usr/src/packages/BUILD'
[  688s] dh_auto_build: error: make -j1 returned exit code 2
[  688s] make: *** [debian/rules:16: build] Error 25
[  688s] dpkg-buildpackage: error: debian/rules build subprocess returned exit status 2
[  688s] ### VM INTERACTION START ###
[  691s] [  623.991395] sysrq: Power Off
[  691s] [  624.078645] reboot: Power down
[  692s] ### VM INTERACTION END ###
[  692s] 
[  692s] lamb26 failed "build simtrace2_0.7.0.85.b218.dsc" at Mon Apr  5 02:13:27 UTC 2021.
[  692s] 

-- 
Configure notifications at https://build.opensuse.org/my/subscriptions
openSUSE Build Service (https://build.opensuse.org/)


More information about the gerrit-log mailing list