Build failure of network:osmocom:nightly/simtrace2 in xUbuntu_18.04/x86_64

OBS Notification admin at opensuse.org
Mon Apr 5 01:53:30 UTC 2021


Visit https://build.opensuse.org/package/live_build_log/network:osmocom:nightly/simtrace2/xUbuntu_18.04/x86_64

Package network:osmocom:nightly/simtrace2 failed to build in xUbuntu_18.04/x86_64

Check out the package for editing:
  osc checkout network:osmocom:nightly simtrace2

Last lines of build log:
[  104s] [COMPILING ./atmel_softpack_libraries/usb/device/dfu/dfu_driver.c]
[  104s] Memory region         Used Size  Region Size  %age Used
[  104s]              rom:       16400 B        16 KB    100.10%
[  104s]              ram:       11688 B        48 KB     23.78/usr/lib/gcc/arm-none-eabi/6.3.1/../../../arm-none-eabi/bin/ld: warning: changing start of section .stack by 4 bytes
[  104s] /usr/lib/gcc/arm-none-eabi/6.3.1/../../../arm-none-eabi/bin/ld: warning: changing start of section .stack by 4 bytes
[  104s] /usr/lib/gcc/arm-none-eabi/6.3.1/../../../arm-none-eabi/bin/ld: bin/qmod-dfu-flash.elf section `.text' will not fit in region `rom'
[  104s] /usr/lib/gcc/arm-none-eabi/6.3.1/../../../arm-none-eabi/bin/ld: warning: changing start of section .stack by 4 bytes
[  104s] /usr/lib/gcc/arm-none-eabi/6.3.1/../../../arm-none-eabi/bin/ld: warning: changing start of section .stack by 4 bytes
[  104s] /usr/lib/gcc/arm-none-eabi/6.3.1/../../../arm-none-eabi/bin/ld: warning: changing start of section .stack by 4 bytes
[  104s] /usr/lib/gcc/arm-none-eabi/6.3.1/../../../arm-none-eabi/bin/ld: region `rom' overflowed by 16 bytes
[  104s] collect2: error: ld returned 1 exit status
[  104s] %
[  104s] Makefile:238: recipe for target 'flash' failed
[  104s] make[2]: *** [flash] Error 1
[  104s] make[2]: Leaving directory '/usr/src/packages/BUILD/firmware'
[  104s] Makefile:13: recipe for target 'fw-qmod-dfu' failed
[  104s] make[1]: *** [fw-qmod-dfu] Error 2
[  104s] make[1]: Leaving directory '/usr/src/packages/BUILD'
[  104s] dh_auto_build: make -j1 returned exit code 2
[  104s] debian/rules:16: recipe for target 'build' failed
[  104s] make: *** [build] Error 2
[  104s] dpkg-buildpackage: error: debian/rules build subprocess returned exit status 2
[  104s] ### VM INTERACTION START ###
[  107s] [   98.514857] sysrq: Power Off
[  107s] [   98.519466] reboot: Power down
[  107s] ### VM INTERACTION END ###
[  107s] 
[  107s] sheep87 failed "build simtrace2_0.7.0.85.b218.dsc" at Mon Apr  5 01:53:20 UTC 2021.
[  107s] 

-- 
Configure notifications at https://build.opensuse.org/my/subscriptions
openSUSE Build Service (https://build.opensuse.org/)


More information about the gerrit-log mailing list