Build failure of network:osmocom:nightly/simtrace2 in Debian_9.0/armv7l

OBS Notification admin at opensuse.org
Mon Apr 5 01:40:28 UTC 2021


Visit https://build.opensuse.org/package/live_build_log/network:osmocom:nightly/simtrace2/Debian_9.0/armv7l

Package network:osmocom:nightly/simtrace2 failed to build in Debian_9.0/armv7l

Check out the package for editing:
  osc checkout network:osmocom:nightly simtrace2

Last lines of build log:
[  166s] [COMPILING ./atmel_softpack_libraries/usb/device/dfu/dfu_driver.c]
[  167s] Memory region         Used Size  Region Size  %age Used
[  167s]              rom:       16400 B        16 KB    100.10%
[  167s]              ram:       11688 B        48 KB     23.78/usr/lib/gcc/arm-none-eabi/5.4.1/../../../arm-none-eabi/bin/ld: warning: changing start of section .stack by 4 bytes
[  167s] /usr/lib/gcc/arm-none-eabi/5.4.1/../../../arm-none-eabi/bin/ld: warning: changing start of section .stack by 4 bytes
[  167s] /usr/lib/gcc/arm-none-eabi/5.4.1/../../../arm-none-eabi/bin/ld: bin/qmod-dfu-flash.elf section `.text' will not fit in region `rom'
[  167s] /usr/lib/gcc/arm-none-eabi/5.4.1/../../../arm-none-eabi/bin/ld: warning: changing start of section .stack by 4 bytes
[  167s] /usr/lib/gcc/arm-none-eabi/5.4.1/../../../arm-none-eabi/bin/ld: warning: changing start of section .stack by 4 bytes
[  167s] /usr/lib/gcc/arm-none-eabi/5.4.1/../../../arm-none-eabi/bin/ld: warning: changing start of section .stack by 4 bytes
[  167s] /usr/lib/gcc/arm-none-eabi/5.4.1/../../../arm-none-eabi/bin/ld: region `rom' overflowed by 16 bytes
[  167s] collect2: error: ld returned 1 exit status
[  167s] %
[  167s] Makefile:238: recipe for target 'flash' failed
[  167s] make[2]: *** [flash] Error 1
[  167s] make[2]: Leaving directory '/usr/src/packages/BUILD/firmware'
[  167s] Makefile:13: recipe for target 'fw-qmod-dfu' failed
[  167s] make[1]: *** [fw-qmod-dfu] Error 2
[  167s] make[1]: Leaving directory '/usr/src/packages/BUILD'
[  167s] dh_auto_build: make -j1 returned exit code 2
[  167s] debian/rules:16: recipe for target 'build' failed
[  167s] make: *** [build] Error 2
[  167s] dpkg-buildpackage: error: debian/rules build gave error exit status 2
[  167s] ### VM INTERACTION START ###
[  170s] [  156.393206] sysrq: SysRq : Power Off
[  170s] [  156.394919] reboot: Power down
[  170s] ### VM INTERACTION END ###
[  170s] 
[  170s] armbuild04 failed "build simtrace2_0.7.0.85.b218.dsc" at Mon Apr  5 01:40:26 UTC 2021.
[  170s] 

-- 
Configure notifications at https://build.opensuse.org/my/subscriptions
openSUSE Build Service (https://build.opensuse.org/)


More information about the gerrit-log mailing list