Build failure of network:osmocom:nightly/simtrace2 in xUbuntu_20.04/x86_64

OBS Notification admin at opensuse.org
Thu Apr 1 01:39:57 UTC 2021


Visit https://build.opensuse.org/package/live_build_log/network:osmocom:nightly/simtrace2/xUbuntu_20.04/x86_64

Package network:osmocom:nightly/simtrace2 failed to build in xUbuntu_20.04/x86_64

Check out the package for editing:
  osc checkout network:osmocom:nightly simtrace2

Last lines of build log:
[  119s] [COMPILING apps/dfu/main.c]
[  119s] [COMPILING ./atmel_softpack_libraries/usb/device/dfu/dfu.c]
[  119s] [COMPILING ./atmel_softpack_libraries/usb/device/dfu/dfu_desc.c]
[  119s] [COMPILING ./atmel_softpack_libraries/usb/device/dfu/dfu_driver.c]
[  119s] Memory region         Used Size  Region Size  %age Used
[  119s]              rom:       16600 B        16 KB    101.32%
[  119s]              ram:       11688 B        48 KB     23.78/usr/lib/gcc/arm-none-eabi/9.2.1/../../../arm-none-eabi/bin/ld: warning: changing start of section .stack by 4 bytes
[  119s] /usr/lib/gcc/arm-none-eabi/9.2.1/../../../arm-none-eabi/bin/ld: warning: changing start of section .stack by 4 bytes
[  119s] /usr/lib/gcc/arm-none-eabi/9.2.1/../../../arm-none-eabi/bin/ld: bin/qmod-dfu-flash.elf section `.text' will not fit in region `rom'
[  119s] /usr/lib/gcc/arm-none-eabi/9.2.1/../../../arm-none-eabi/bin/ld: warning: changing start of section .stack by 4 bytes
[  119s] /usr/lib/gcc/arm-none-eabi/9.2.1/../../../arm-none-eabi/bin/ld: warning: changing start of section .stack by 4 bytes
[  119s] /usr/lib/gcc/arm-none-eabi/9.2.1/../../../arm-none-eabi/bin/ld: warning: changing start of section .stack by 4 bytes
[  119s] /usr/lib/gcc/arm-none-eabi/9.2.1/../../../arm-none-eabi/bin/ld: region `rom' overflowed by 216 bytes
[  119s] collect2: error: ld returned 1 exit status
[  119s] %
[  119s] make[2]: *** [Makefile:230: flash] Error 1
[  119s] make[2]: Leaving directory '/usr/src/packages/BUILD/firmware'
[  119s] make[1]: *** [Makefile:13: fw-qmod-dfu] Error 2
[  119s] make[1]: Leaving directory '/usr/src/packages/BUILD'
[  119s] dh_auto_build: error: make -j1 returned exit code 2
[  119s] make: *** [debian/rules:16: build] Error 25
[  119s] dpkg-buildpackage: error: debian/rules build subprocess returned exit status 2
[  119s] ### VM INTERACTION START ###
[  122s] [  112.164843] sysrq: Power Off
[  122s] [  112.171717] reboot: Power down
[  122s] ### VM INTERACTION END ###
[  122s] 
[  122s] sheep87 failed "build simtrace2_0.7.0.76.62ad.dsc" at Thu Apr  1 01:39:47 UTC 2021.
[  122s] 

-- 
Configure notifications at https://build.opensuse.org/my/subscriptions
openSUSE Build Service (https://build.opensuse.org/)


More information about the gerrit-log mailing list