Build failure of network:osmocom:latest/openbsc in Debian_Unstable/x86_64

OBS Notification admin at opensuse.org
Sat May 25 03:51:44 UTC 2019


Visit https://build.opensuse.org/package/live_build_log/network:osmocom:latest/openbsc/Debian_Unstable/x86_64

Package network:osmocom:latest/openbsc failed to build in Debian_Unstable/x86_64

Check out the package for editing:
  osc checkout network:osmocom:latest openbsc

Last lines of build log:
[  169s] | #define HAVE_MEMORY_H 1
[  169s] | #define HAVE_STRINGS_H 1
[  169s] | #define HAVE_INTTYPES_H 1
[  169s] | #define HAVE_STDINT_H 1
[  169s] | #define HAVE_UNISTD_H 1
[  169s] | #define HAVE_DLFCN_H 1
[  169s] | #define LT_OBJDIR ".libs/"
[  169s] | #define BUILD_SMPP 1
[  169s] | #define STDC_HEADERS 1
[  169s] | #define HAVE_DBI_DBD_H 1
[  169s] | #define HAVE_PCAP_PCAP_H 1
[  169s] | #define HAVE_TM_GMTOFF_IN_TM 1
[  169s] | 
[  169s] | configure: exit 0
[  169s] 
[  169s] make[1]: *** [debian/rules:30: override_dh_auto_test] Error 1
[  169s] make[1]: Leaving directory '/usr/src/packages/BUILD'
[  169s] make: *** [debian/rules:13: build] Error 2
[  169s] dpkg-buildpackage: error: debian/rules build subprocess returned exit status 2
[  169s] 
[  169s] lamb51 failed "build openbsc_1.2.0.dsc" at Sat May 25 03:51:29 UTC 2019.
[  169s] 
[  169s] ### VM INTERACTION START ###
[  173s] [  159.650943] sysrq: SysRq : Power Off
[  173s] [  159.657259] reboot: Power down
[  173s] ### VM INTERACTION END ###
[  173s] 
[  173s] lamb51 failed "build openbsc_1.2.0.dsc" at Sat May 25 03:51:33 UTC 2019.
[  173s] 

-- 
Configure notifications at https://build.opensuse.org/user/notifications
openSUSE Build Service (https://build.opensuse.org/)


More information about the gerrit-log mailing list