Build failure of network:osmocom:nightly/openbsc in Debian_Unstable/x86_64

OBS Notification admin at opensuse.org
Wed May 22 02:48:18 UTC 2019


Visit https://build.opensuse.org/package/live_build_log/network:osmocom:nightly/openbsc/Debian_Unstable/x86_64

Package network:osmocom:nightly/openbsc failed to build in Debian_Unstable/x86_64

Check out the package for editing:
  osc checkout network:osmocom:nightly openbsc

Last lines of build log:
[  165s] | #define HAVE_MEMORY_H 1
[  165s] | #define HAVE_STRINGS_H 1
[  165s] | #define HAVE_INTTYPES_H 1
[  165s] | #define HAVE_STDINT_H 1
[  165s] | #define HAVE_UNISTD_H 1
[  165s] | #define HAVE_DLFCN_H 1
[  165s] | #define LT_OBJDIR ".libs/"
[  165s] | #define BUILD_SMPP 1
[  165s] | #define STDC_HEADERS 1
[  165s] | #define HAVE_DBI_DBD_H 1
[  165s] | #define HAVE_PCAP_PCAP_H 1
[  165s] | #define HAVE_TM_GMTOFF_IN_TM 1
[  165s] | 
[  165s] | configure: exit 0
[  165s] 
[  165s] make[1]: *** [debian/rules:30: override_dh_auto_test] Error 1
[  165s] make[1]: Leaving directory '/usr/src/packages/BUILD'
[  165s] make: *** [debian/rules:13: build] Error 2
[  165s] dpkg-buildpackage: error: debian/rules build subprocess returned exit status 2
[  165s] 
[  165s] lamb18 failed "build openbsc_1.2.0.20190522.dsc" at Wed May 22 02:48:03 UTC 2019.
[  165s] 
[  165s] ### VM INTERACTION START ###
[  168s] [  153.988394] sysrq: SysRq : Power Off
[  168s] [  153.994549] reboot: Power down
[  168s] ### VM INTERACTION END ###
[  168s] 
[  168s] lamb18 failed "build openbsc_1.2.0.20190522.dsc" at Wed May 22 02:48:07 UTC 2019.
[  168s] 

-- 
Configure notifications at https://build.opensuse.org/user/notifications
openSUSE Build Service (https://build.opensuse.org/)


More information about the gerrit-log mailing list