Build failure of network:osmocom:latest/openbsc in xUbuntu_19.04/i586

OBS Notification admin at opensuse.org
Tue May 21 16:38:24 UTC 2019


Visit https://build.opensuse.org/package/live_build_log/network:osmocom:latest/openbsc/xUbuntu_19.04/i586

Package network:osmocom:latest/openbsc failed to build in xUbuntu_19.04/i586

Check out the package for editing:
  osc checkout network:osmocom:latest openbsc

Last lines of build log:
[  191s] | #define HAVE_MEMORY_H 1
[  191s] | #define HAVE_STRINGS_H 1
[  191s] | #define HAVE_INTTYPES_H 1
[  191s] | #define HAVE_STDINT_H 1
[  191s] | #define HAVE_UNISTD_H 1
[  191s] | #define HAVE_DLFCN_H 1
[  191s] | #define LT_OBJDIR ".libs/"
[  191s] | #define BUILD_SMPP 1
[  191s] | #define STDC_HEADERS 1
[  191s] | #define HAVE_DBI_DBD_H 1
[  191s] | #define HAVE_PCAP_PCAP_H 1
[  191s] | #define HAVE_TM_GMTOFF_IN_TM 1
[  191s] | 
[  191s] | configure: exit 0
[  191s] 
[  191s] make[1]: *** [debian/rules:30: override_dh_auto_test] Error 1
[  191s] make[1]: Leaving directory '/usr/src/packages/BUILD'
[  191s] make: *** [debian/rules:13: build] Error 2
[  191s] dpkg-buildpackage: error: debian/rules build subprocess returned exit status 2
[  191s] 
[  191s] lamb14 failed "build openbsc_1.2.0.dsc" at Tue May 21 16:38:09 UTC 2019.
[  191s] 
[  191s] ### VM INTERACTION START ###
[  194s] [  182.419601] sysrq: SysRq : Power Off
[  194s] [  182.426678] reboot: Power down
[  194s] ### VM INTERACTION END ###
[  194s] 
[  194s] lamb14 failed "build openbsc_1.2.0.dsc" at Tue May 21 16:38:13 UTC 2019.
[  194s] 

-- 
Configure notifications at https://build.opensuse.org/user/notifications
openSUSE Build Service (https://build.opensuse.org/)


More information about the gerrit-log mailing list