Build failure of network:osmocom:nightly/libosmo-netif in Debian_9.0/armv7l

OBS Notification admin at opensuse.org
Sat May 18 03:06:24 UTC 2019


Visit https://build.opensuse.org/package/live_build_log/network:osmocom:nightly/libosmo-netif/Debian_9.0/armv7l

Package network:osmocom:nightly/libosmo-netif failed to build in Debian_9.0/armv7l

Check out the package for editing:
  osc checkout network:osmocom:nightly libosmo-netif

Last lines of build log:
[  240s] extracted packet: RTP ver=2 ssrc=117440512 type=98 marker=0 ext=0 csrc_count=0 sequence=9576 timestamp=1681759657 [20 14 ff d4 f9 ff fb e7 eb f9 9f f8 f2 26 33 65 54 ]
[  240s] extracted packet: RTP ver=2 ssrc=117440512 type=98 marker=0 ext=0 csrc_count=0 sequence=9577 timestamp=1681759817 [20 14 ff d4 f9 ff fb e7 eb f9 9f f8 f2 26 33 65 54 ]
[  240s] extracted packet: RTP ver=2 ssrc=117440512 type=98 marker=0 ext=0 csrc_count=0 sequence=9578 timestamp=1681759977 [20 14 ff d4 f9 ff fb e7 eb f9 9f f8 f2 26 33 65 54 ]
[  240s] extracted packet: RTP ver=2 ssrc=117440512 type=98 marker=0 ext=0 csrc_count=0 sequence=9579 timestamp=1681760137 [20 14 ff d4 f9 ff fb e7 eb f9 9f f8 f2 26 33 65 54 ]
[  240s] extracted packet: RTP ver=2 ssrc=117440512 type=98 marker=0 ext=0 csrc_count=0 sequence=9580 timestamp=1681760297 [20 14 ff d4 f9 ff fb e7 eb f9 9f f8 f2 26 33 65 54 ]
[  240s] extracted packet: RTP ver=2 ssrc=117440512 type=98 marker=0 ext=0 csrc_count=0 sequence=9581 timestamp=1681760457 [20 14 ff d4 f9 ff fb e7 eb f9 9f f8 f2 26 33 65 54 ]
[  240s] --- expout	2019-05-18 03:05:53.625000000 +0000
[  240s] +++ /usr/src/packages/BUILD/tests/testsuite.dir/at-groups/2/stdout	2019-05-18 03:06:03.645000000 +0000
[  240s] @@ -1 +1 @@
[  240s] -OK: Test passed
[  240s] +FAIL: test did not run successfully
[  240s] ./testsuite.at:14: exit code was 1, expected 0
[  240s] 2. testsuite.at:11: 2. osmux_test (testsuite.at:11): FAILED (testsuite.at:14)
[  240s] debian/rules:27: recipe for target 'override_dh_auto_test' failed
[  240s] make[1]: *** [override_dh_auto_test] Error 1
[  240s] make[1]: Leaving directory '/usr/src/packages/BUILD'
[  240s] debian/rules:13: recipe for target 'build' failed
[  240s] make: *** [build] Error 2
[  240s] dpkg-buildpackage: error: debian/rules build gave error exit status 2
[  240s] 
[  240s] armbuild24 failed "build libosmo-netif_0.5.0.dsc" at Sat May 18 03:06:07 UTC 2019.
[  240s] 
[  240s] ### VM INTERACTION START ###
[  242s] [  222.004032] sysrq: SysRq : Power Off
[  242s] [  222.033382] reboot: Power down
[  243s] ### VM INTERACTION END ###
[  243s] 
[  243s] armbuild24 failed "build libosmo-netif_0.5.0.dsc" at Sat May 18 03:06:11 UTC 2019.
[  243s] 

-- 
Configure notifications at https://build.opensuse.org/user/notifications
openSUSE Build Service (https://build.opensuse.org/)


More information about the gerrit-log mailing list