Build failure of network:osmocom:latest/osmo-bsc in xUbuntu_18.10/x86_64

OBS Notification admin at opensuse.org
Wed May 8 03:41:21 UTC 2019


Visit https://build.opensuse.org/package/live_build_log/network:osmocom:latest/osmo-bsc/xUbuntu_18.10/x86_64

Package network:osmocom:latest/osmo-bsc failed to build in xUbuntu_18.10/x86_64

Check out the package for editing:
  osc checkout network:osmocom:latest osmo-bsc

Last lines of build log:
[  176s] DRSL handover_fsm.c:844 handover(intraCell_conn4294967295_IMSI000003){WAIT_LCHAN_ACTIVE}: Terminating (cause = OSMO_FSM_TERM_REGULAR)
[  176s] DRSL handover_fsm.c:844 handover(intraCell_conn4294967295_IMSI000003){WAIT_LCHAN_ACTIVE}: Freeing instance
[  176s] DRSL fsm.c:535 handover(intraCell_conn4294967295_IMSI000003){WAIT_LCHAN_ACTIVE}: Deallocated
[  176s] DCHAN lchan_fsm.c:544 lchan(0-0-1-TCH_F-0){WAIT_BEFORE_RF_RELEASE}: state_chg to UNUSED
[  176s] DCHAN lchan_fsm.c:377 lchan(0-0-1-TCH_F-0){UNUSED}: (type=TCH_F) Clearing lchan state
[  176s] DTS lchan_fsm.c:410 timeslot(0-0-1-TCH_F){UNUSED}: Received Event TS_EV_LCHAN_UNUSED
[  176s] DHODEC handover_decision_2.c:1824 Congestion at BTS 0 reduced!
[  176s] - Expecting channel request at BTS 0 TS 1
[  176s] --- expout	2019-05-08 03:40:43.556000000 +0000
[  176s] +++ /usr/src/packages/BUILD/tests/testsuite.dir/at-groups/35/stdout	2019-05-08 03:40:43.564000000 +0000
[  176s] @@ -1 +1 @@
[  176s] -Test OK
[  176s] +Test failed, because no channel was requested
[  176s] ./testsuite.at:213: exit code was 1, expected 0
[  176s] 35. testsuite.at:210: 35. handover test 27 (testsuite.at:210): FAILED (testsuite.at:213)
[  176s] make[1]: *** [debian/rules:62: override_dh_auto_test] Error 1
[  176s] make[1]: Leaving directory '/usr/src/packages/BUILD'
[  176s] make: *** [debian/rules:45: build] Error 2
[  176s] dpkg-buildpackage: error: debian/rules build subprocess returned exit status 2
[  176s] 
[  176s] lamb13 failed "build osmo-bsc_1.4.0.dsc" at Wed May  8 03:41:03 UTC 2019.
[  176s] 
[  176s] ### VM INTERACTION START ###
[  179s] [  167.814821] sysrq: SysRq : Power Off
[  179s] [  167.821399] reboot: Power down
[  179s] ### VM INTERACTION END ###
[  179s] 
[  179s] lamb13 failed "build osmo-bsc_1.4.0.dsc" at Wed May  8 03:41:07 UTC 2019.
[  179s] 

-- 
Configure notifications at https://build.opensuse.org/user/notifications
openSUSE Build Service (https://build.opensuse.org/)


More information about the gerrit-log mailing list