Build failure of network:osmocom:latest/osmo-bsc in xUbuntu_18.04/x86_64

OBS Notification admin at opensuse.org
Wed May 8 03:39:21 UTC 2019


Visit https://build.opensuse.org/package/live_build_log/network:osmocom:latest/osmo-bsc/xUbuntu_18.04/x86_64

Package network:osmocom:latest/osmo-bsc failed to build in xUbuntu_18.04/x86_64

Check out the package for editing:
  osc checkout network:osmocom:latest osmo-bsc

Last lines of build log:
[  177s] | #define HAVE_STRING_H 1
[  177s] | #define HAVE_MEMORY_H 1
[  177s] | #define HAVE_STRINGS_H 1
[  177s] | #define HAVE_INTTYPES_H 1
[  177s] | #define HAVE_STDINT_H 1
[  177s] | #define HAVE_UNISTD_H 1
[  177s] | #define HAVE_DLFCN_H 1
[  177s] | #define LT_OBJDIR ".libs/"
[  177s] | #define STDC_HEADERS 1
[  177s] | #define HAVE_CDK_CDK_H 1
[  177s] | 
[  177s] | configure: exit 0
[  177s] 
[  177s] debian/rules:62: recipe for target 'override_dh_auto_test' failed
[  177s] make[1]: *** [override_dh_auto_test] Error 1
[  177s] make[1]: Leaving directory '/usr/src/packages/BUILD'
[  177s] debian/rules:45: recipe for target 'build' failed
[  177s] make: *** [build] Error 2
[  177s] dpkg-buildpackage: error: debian/rules build subprocess returned exit status 2
[  177s] 
[  177s] lamb55 failed "build osmo-bsc_1.4.0.dsc" at Wed May  8 03:39:09 UTC 2019.
[  177s] 
[  177s] ### VM INTERACTION START ###
[  179s] [  166.265290] sysrq: SysRq : Power Off
[  179s] [  166.271036] reboot: Power down
[  179s] ### VM INTERACTION END ###
[  179s] 
[  179s] lamb55 failed "build osmo-bsc_1.4.0.dsc" at Wed May  8 03:39:13 UTC 2019.
[  179s] 

-- 
Configure notifications at https://build.opensuse.org/user/notifications
openSUSE Build Service (https://build.opensuse.org/)


More information about the gerrit-log mailing list