Build failure of network:osmocom:latest/osmo-bsc in xUbuntu_17.10/x86_64

OBS Notification admin at opensuse.org
Wed May 8 03:02:45 UTC 2019


Visit https://build.opensuse.org/package/live_build_log/network:osmocom:latest/osmo-bsc/xUbuntu_17.10/x86_64

Package network:osmocom:latest/osmo-bsc failed to build in xUbuntu_17.10/x86_64

Check out the package for editing:
  osc checkout network:osmocom:latest osmo-bsc

Last lines of build log:
[  118s] DRSL handover_fsm.c:844 handover(intraBSC_conn4294967295_IMSI000001){WAIT_LCHAN_ACTIVE}: Freeing instance
[  118s] DRSL fsm.c:535 handover(intraBSC_conn4294967295_IMSI000001){WAIT_LCHAN_ACTIVE}: Deallocated
[  118s] DCHAN lchan_fsm.c:544 lchan(1-0-1-TCH_F-0){WAIT_BEFORE_RF_RELEASE}: state_chg to UNUSED
[  118s] DCHAN lchan_fsm.c:377 lchan(1-0-1-TCH_F-0){UNUSED}: (type=TCH_F) Clearing lchan state
[  118s] DTS lchan_fsm.c:410 timeslot(1-0-1-TCH_F){UNUSED}: Received Event TS_EV_LCHAN_UNUSED
[  118s] - Expecting channel request at BTS 1 TS 1
[  118s] --- expout	2019-05-08 03:02:19.712000000 +0000
[  118s] +++ /usr/src/packages/BUILD/tests/testsuite.dir/at-groups/24/stdout	2019-05-08 03:02:19.716000000 +0000
[  118s] @@ -1 +1 @@
[  118s] -Test OK
[  118s] +Test failed, because no channel was requested
[  118s] ./testsuite.at:147: exit code was 1, expected 0
[  118s] 24. testsuite.at:144: 24. handover test 16 (testsuite.at:144): FAILED (testsuite.at:147)
[  118s] debian/rules:62: recipe for target 'override_dh_auto_test' failed
[  118s] make[1]: *** [override_dh_auto_test] Error 1
[  118s] make[1]: Leaving directory '/usr/src/packages/BUILD'
[  118s] debian/rules:45: recipe for target 'build' failed
[  118s] make: *** [build] Error 2
[  118s] dpkg-buildpackage: error: debian/rules build gave error exit status 2
[  118s] 
[  118s] sheep81 failed "build osmo-bsc_1.4.0.dsc" at Wed May  8 03:02:37 UTC 2019.
[  118s] 
[  118s] ### VM INTERACTION START ###
[  121s] [  111.655405] sysrq: SysRq : Power Off
[  121s] [  111.660373] reboot: Power down
[  121s] ### VM INTERACTION END ###
[  121s] 
[  121s] sheep81 failed "build osmo-bsc_1.4.0.dsc" at Wed May  8 03:02:40 UTC 2019.
[  121s] 

-- 
Configure notifications at https://build.opensuse.org/user/notifications
openSUSE Build Service (https://build.opensuse.org/)


More information about the gerrit-log mailing list