Build failure of network:osmocom:latest/osmo-bsc in Debian_8.0/x86_64

OBS Notification admin at opensuse.org
Wed May 8 02:43:04 UTC 2019


Visit https://build.opensuse.org/package/live_build_log/network:osmocom:latest/osmo-bsc/Debian_8.0/x86_64

Package network:osmocom:latest/osmo-bsc failed to build in Debian_8.0/x86_64

Check out the package for editing:
  osc checkout network:osmocom:latest osmo-bsc

Last lines of build log:
[  297s] | #define HAVE_STRING_H 1
[  297s] | #define HAVE_MEMORY_H 1
[  297s] | #define HAVE_STRINGS_H 1
[  297s] | #define HAVE_INTTYPES_H 1
[  297s] | #define HAVE_STDINT_H 1
[  297s] | #define HAVE_UNISTD_H 1
[  297s] | #define HAVE_DLFCN_H 1
[  297s] | #define LT_OBJDIR ".libs/"
[  297s] | #define STDC_HEADERS 1
[  297s] | #define HAVE_CDK_CDK_H 1
[  297s] | 
[  297s] | configure: exit 0
[  297s] 
[  297s] debian/rules:62: recipe for target 'override_dh_auto_test' failed
[  297s] make[1]: *** [override_dh_auto_test] Error 1
[  297s] make[1]: Leaving directory '/usr/src/packages/BUILD'
[  297s] debian/rules:45: recipe for target 'build' failed
[  297s] make: *** [build] Error 2
[  297s] dpkg-buildpackage: error: debian/rules build gave error exit status 2
[  297s] 
[  297s] lamb62 failed "build osmo-bsc_1.4.0.dsc" at Wed May  8 02:42:59 UTC 2019.
[  297s] 
[  297s] ### VM INTERACTION START ###
[  297s] Powering off.
[  298s] [  277.085018] reboot: Power down
[  298s] ### VM INTERACTION END ###
[  298s] 
[  298s] lamb62 failed "build osmo-bsc_1.4.0.dsc" at Wed May  8 02:43:02 UTC 2019.
[  298s] 

-- 
Configure notifications at https://build.opensuse.org/user/notifications
openSUSE Build Service (https://build.opensuse.org/)


More information about the gerrit-log mailing list