Build failure of network:osmocom:latest/osmo-sgsn in Debian_8.0/x86_64

OBS Notification admin at opensuse.org
Wed May 8 02:31:23 UTC 2019


Visit https://build.opensuse.org/package/live_build_log/network:osmocom:latest/osmo-sgsn/Debian_8.0/x86_64

Package network:osmocom:latest/osmo-sgsn failed to build in Debian_8.0/x86_64

Check out the package for editing:
  osc checkout network:osmocom:latest osmo-sgsn

Last lines of build log:
[   84s]  
[   84s]  PROCESSING ALIVE_ACK from 0x05060708:32000
[   84s]  0b 
[   84s] @@ -7311,7 +7311,7 @@
[   84s]  MESSAGE to SGSN at 0x05060708:32000, msg length 1
[   84s]  0a 
[   84s]  
[   84s] -result (RESET_ACK) = 1
[   84s] +result (RESET_ACK) = 0
[   84s]  
[   84s]  PROCESSING ALIVE_ACK from 0x05060708:32000
[   84s]  0b 
[   84s] 2. testsuite.at:10: 2. gbproxy (testsuite.at:10): FAILED (testsuite.at:13)
[   84s] debian/rules:65: recipe for target 'override_dh_auto_test' failed
[   84s] make[1]: *** [override_dh_auto_test] Error 1
[   84s] make[1]: Leaving directory '/usr/src/packages/BUILD'
[   84s] debian/rules:45: recipe for target 'build' failed
[   84s] make: *** [build] Error 2
[   84s] dpkg-buildpackage: error: debian/rules build gave error exit status 2
[   84s] 
[   84s] sheep81 failed "build osmo-sgsn_1.4.0.dsc" at Wed May  8 02:31:17 UTC 2019.
[   84s] 
[   84s] ### VM INTERACTION START ###
[   85s] Powering off.
[   85s] [   76.486201] reboot: Power down
[   85s] ### VM INTERACTION END ###
[   85s] 
[   85s] sheep81 failed "build osmo-sgsn_1.4.0.dsc" at Wed May  8 02:31:18 UTC 2019.
[   85s] 

-- 
Configure notifications at https://build.opensuse.org/user/notifications
openSUSE Build Service (https://build.opensuse.org/)


More information about the gerrit-log mailing list