Build failure of network:osmocom:nightly/openbsc in Debian_9.0/x86_64

OBS Notification admin at opensuse.org
Fri Mar 22 02:46:18 UTC 2019


Visit https://build.opensuse.org/package/live_build_log/network:osmocom:nightly/openbsc/Debian_9.0/x86_64

Package network:osmocom:nightly/openbsc failed to build in Debian_9.0/x86_64

Check out the package for editing:
  osc checkout network:osmocom:nightly openbsc

Last lines of build log:
[  147s]  int osmo_init_logging(const struct log_info *)
[  147s]      ^~~~~~~~~~~~~~~~~
[  147s] /bin/bash ../../libtool  --tag=CC   --mode=link gcc -Wall  -I/usr/include/ -I/usr/include/ -I/usr/include/ -I/usr/include/ -I/usr/include/ -I/usr/include/   -g -O2 -fdebug-prefix-map=/usr/src/packages/BUILD=. -fstack-protector-strong -Wformat -Werror=format-security -Werror=implicit -Werror=maybe-uninitialized -Werror=memset-transposed-args -Werror=null-dereference -Werror=sizeof-array-argument -Werror=sizeof-pointer-memaccess   -Wl,-z,relro -Wl,-z,now -o osmo-nitb bsc_hack.o ../../src/libbsc/libbsc.a ../../src/libcommon-cs/libcommon-cs.a ../../src/libmsc/libmsc.a ../../src/libtrau/libtrau.a ../../src/libcommon/libcommon.a -ltalloc -losmogsm -losmocore -ltalloc -losmovty -losmocore -ltalloc -losmocore -ltalloc -losmoctrl -losmogsm -losmocore -losmoabis -lsmpp34  -ldbi  
[  147s] libtool: link: gcc -Wall -I/usr/include/ -I/usr/include/ -I/usr/include/ -I/usr/include/ -I/usr/include/ -I/usr/include/ -g -O2 -fdebug-prefix-map=/usr/src/packages/BUILD=. -fstack-protector-strong -Wformat -Werror=format-security -Werror=implicit -Werror=maybe-uninitialized -Werror=memset-transposed-args -Werror=null-dereference -Werror=sizeof-array-argument -Werror=sizeof-pointer-memaccess -Wl,-z -Wl,relro -Wl,-z -Wl,now -o osmo-nitb bsc_hack.o  ../../src/libbsc/libbsc.a ../../src/libcommon-cs/libcommon-cs.a ../../src/libmsc/libmsc.a ../../src/libtrau/libtrau.a ../../src/libcommon/libcommon.a /usr/lib/x86_64-linux-gnu/libosmovty.so -ltalloc /usr/lib/x86_64-linux-gnu/libosmoctrl.so /usr/lib/x86_64-linux-gnu/libosmogsm.so /usr/lib/x86_64-linux-gnu/libosmocore.so /usr/lib/x86_64-linux-gnu/libosmoabis.so /usr/lib/x86_64-linux-gnu/libsmpp34.so -ldbi
[  148s] ../../src/libcommon/libcommon.a(talloc_ctx.o): In function `talloc_ctx_init':
[  148s] ./openbsc/src/libcommon/talloc_ctx.c:50: undefined reference to `tall_sigh_ctx'
[  148s] collect2: error: ld returned 1 exit status
[  148s] Makefile:483: recipe for target 'osmo-nitb' failed
[  148s] make[4]: *** [osmo-nitb] Error 1
[  148s] make[4]: Leaving directory '/usr/src/packages/BUILD/openbsc/src/osmo-nitb'
[  148s] Makefile:450: recipe for target 'all-recursive' failed
[  148s] make[3]: *** [all-recursive] Error 1
[  148s] make[3]: Leaving directory '/usr/src/packages/BUILD/openbsc/src'
[  148s] Makefile:470: recipe for target 'all-recursive' failed
[  148s] make[2]: *** [all-recursive] Error 1
[  148s] make[2]: Leaving directory '/usr/src/packages/BUILD/openbsc'
[  148s] Makefile:402: recipe for target 'all' failed
[  148s] make[1]: *** [all] Error 2
[  148s] make[1]: Leaving directory '/usr/src/packages/BUILD/openbsc'
[  148s] dh_auto_build: make -j1 returned exit code 2
[  148s] debian/rules:13: recipe for target 'build' failed
[  148s] make: *** [build] Error 2
[  148s] dpkg-buildpackage: error: debian/rules build gave error exit status 2
[  148s] 
[  148s] cloud106 failed "build openbsc_1.2.0.20190322.dsc" at Fri Mar 22 02:46:10 UTC 2019.
[  148s] 
[  148s] ### VM INTERACTION START ###
[  151s] [  122.717474] sysrq: SysRq : Power Off
[  151s] [  122.730492] reboot: Power down

-- 
Configure notifications at https://build.opensuse.org/user/notifications
openSUSE Build Service (https://build.opensuse.org/)


More information about the gerrit-log mailing list