Build failed in Jenkins: master-osmo-trx » --with-sse,1,a3=default,a4=default,osmocom-master-debian9 #912

jenkins at lists.osmocom.org jenkins at lists.osmocom.org
Fri Mar 1 09:42:00 UTC 2019


See <https://jenkins.osmocom.org/jenkins/job/master-osmo-trx/INSTR=--with-sse,WITH_MANUALS=1,a3=default,a4=default,label=osmocom-master-debian9/912/display/redirect>

------------------------------------------
[...truncated 107.49 KB...]
Searching INPUT for files to process...
Reading and parsing tag files
Parsing files
Building group list...
Building directory list...
Building namespace list...
Building file list...
Building class list...
Associating documentation with classes...
Computing nesting relations for classes...
Building example list...
Searching for enumerations...
Searching for documented typedefs...
Searching for members imported via using declarations...
Searching for included using directives...
Searching for documented variables...
Building interface member list...
Building member list...
Searching for friends...
Searching for documented defines...
Computing class inheritance relations...
Computing class usage relations...
Flushing cached template relations that have become invalid...
Computing class relations...
Add enum values to enums...
Searching for member function documentation...
Creating members for template instances...
Building page list...
Search for main page...
Computing page relations...
Determining the scope of groups...
Sorting lists...
Freeing entry tree
Determining which enums are documented
Computing member relations...
Building full member lists recursively...
Adding members to member groups.
Computing member references...
Inheriting documentation...
Generating disk names...
Adding source references...
Adding xrefitems...
Sorting member lists...
Computing dependencies between directories...
Generating citations page...
Counting data structures...
Resolving user defined references...
Finding anchors and sections in the documentation...
Transferring function references...
Combining using relations...
Adding members to index pages...
Generating style sheet...
Generating search indices...
Generating example documentation...
Generating file sources...
Generating file documentation...
Generating page documentation...
Generating group documentation...
Generating class documentation...
Generating namespace index...
Generating graph info page...
Generating directory documentation...
Generating index page...
Generating page index...
Generating module index...
Generating namespace index...
Generating namespace member index...
Generating annotated compound index...
Generating alphabetical compound index...
Generating hierarchical class index...
Generating graphical class hierarchy...
Generating member index...
Generating file index...
Generating file member index...
Generating example index...
finalizing index lists...
writing tag file...
Running dot...
Running dot for graph 1/1
lookup cache used 0/65536 hits=0 misses=0
finished...
make[5]: Entering directory '<https://jenkins.osmocom.org/jenkins/job/master-osmo-trx/INSTR=--with-sse,WITH_MANUALS=1,a3=default,a4=default,label=osmocom-master-debian9/ws/deps/libusrp/doc'>
make[5]: Nothing to be done for 'install-exec-am'.
/bin/mkdir -p <https://jenkins.osmocom.org/jenkins/job/master-osmo-trx/INSTR=--with-sse,WITH_MANUALS=1,a3=default,a4=default,label=osmocom-master-debian9/ws/deps/install/stow/libusrp/share/doc/usrp-/html>
 /bin/mkdir -p '<https://jenkins.osmocom.org/jenkins/job/master-osmo-trx/INSTR=--with-sse,WITH_MANUALS=1,a3=default,a4=default,label=osmocom-master-debian9/ws/deps/install/stow/libusrp/share/doc/usrp-'>
/usr/bin/install -c -m 644 usrp_guide.html <https://jenkins.osmocom.org/jenkins/job/master-osmo-trx/INSTR=--with-sse,WITH_MANUALS=1,a3=default,a4=default,label=osmocom-master-debian9/ws/deps/install/stow/libusrp/share/doc/usrp-/html>
cp -r html <https://jenkins.osmocom.org/jenkins/job/master-osmo-trx/INSTR=--with-sse,WITH_MANUALS=1,a3=default,a4=default,label=osmocom-master-debian9/ws/deps/install/stow/libusrp/share/doc/usrp->
 /usr/bin/install -c -m 644 ../README '<https://jenkins.osmocom.org/jenkins/job/master-osmo-trx/INSTR=--with-sse,WITH_MANUALS=1,a3=default,a4=default,label=osmocom-master-debian9/ws/deps/install/stow/libusrp/share/doc/usrp-'>
make[5]: Leaving directory '<https://jenkins.osmocom.org/jenkins/job/master-osmo-trx/INSTR=--with-sse,WITH_MANUALS=1,a3=default,a4=default,label=osmocom-master-debian9/ws/deps/libusrp/doc'>
make[4]: Leaving directory '<https://jenkins.osmocom.org/jenkins/job/master-osmo-trx/INSTR=--with-sse,WITH_MANUALS=1,a3=default,a4=default,label=osmocom-master-debian9/ws/deps/libusrp/doc'>
make[3]: Leaving directory '<https://jenkins.osmocom.org/jenkins/job/master-osmo-trx/INSTR=--with-sse,WITH_MANUALS=1,a3=default,a4=default,label=osmocom-master-debian9/ws/deps/libusrp/doc'>
make[2]: Leaving directory '<https://jenkins.osmocom.org/jenkins/job/master-osmo-trx/INSTR=--with-sse,WITH_MANUALS=1,a3=default,a4=default,label=osmocom-master-debian9/ws/deps/libusrp/doc'>
Making install in firmware
make[2]: Entering directory '<https://jenkins.osmocom.org/jenkins/job/master-osmo-trx/INSTR=--with-sse,WITH_MANUALS=1,a3=default,a4=default,label=osmocom-master-debian9/ws/deps/libusrp/firmware'>
Making install in include
make[3]: Entering directory '<https://jenkins.osmocom.org/jenkins/job/master-osmo-trx/INSTR=--with-sse,WITH_MANUALS=1,a3=default,a4=default,label=osmocom-master-debian9/ws/deps/libusrp/firmware/include'>
make[4]: Entering directory '<https://jenkins.osmocom.org/jenkins/job/master-osmo-trx/INSTR=--with-sse,WITH_MANUALS=1,a3=default,a4=default,label=osmocom-master-debian9/ws/deps/libusrp/firmware/include'>
make[4]: Nothing to be done for 'install-exec-am'.
 /bin/mkdir -p '<https://jenkins.osmocom.org/jenkins/job/master-osmo-trx/INSTR=--with-sse,WITH_MANUALS=1,a3=default,a4=default,label=osmocom-master-debian9/ws/deps/install/stow/libusrp/include/usrp'>
 /usr/bin/install -c -m 644 usrp_i2c_addr.h usrp_spi_defs.h fpga_regs_common.h fpga_regs_standard.h '<https://jenkins.osmocom.org/jenkins/job/master-osmo-trx/INSTR=--with-sse,WITH_MANUALS=1,a3=default,a4=default,label=osmocom-master-debian9/ws/deps/install/stow/libusrp/include/usrp'>
make[4]: Leaving directory '<https://jenkins.osmocom.org/jenkins/job/master-osmo-trx/INSTR=--with-sse,WITH_MANUALS=1,a3=default,a4=default,label=osmocom-master-debian9/ws/deps/libusrp/firmware/include'>
make[3]: Leaving directory '<https://jenkins.osmocom.org/jenkins/job/master-osmo-trx/INSTR=--with-sse,WITH_MANUALS=1,a3=default,a4=default,label=osmocom-master-debian9/ws/deps/libusrp/firmware/include'>
Making install in lib
make[3]: Entering directory '<https://jenkins.osmocom.org/jenkins/job/master-osmo-trx/INSTR=--with-sse,WITH_MANUALS=1,a3=default,a4=default,label=osmocom-master-debian9/ws/deps/libusrp/firmware/lib'>
sdcc -mmcs51 --no-xinit-opt -I../../firmware/include  -c delay.c -o delay.rel
sdcc -mmcs51 --no-xinit-opt -I../../firmware/include  -c fx2utils.c -o fx2utils.rel
sdcc -mmcs51 --no-xinit-opt -I../../firmware/include  -c i2c.c -o i2c.rel
sdcc -mmcs51 --no-xinit-opt -I../../firmware/include  -c isr.c -o isr.rel
sdcc -mmcs51 --no-xinit-opt -I../../firmware/include  -c timer.c -o timer.rel
sdcc -mmcs51 --no-xinit-opt -I../../firmware/include  -c usb_common.c -o usb_common.rel
timer.c:45: warning 158: overflow in implicit constant conversion
usb_common.c:65: warning 196: pointer target lost const qualifier
usb_common.c:66: warning 196: pointer target lost const qualifier
usb_common.c:67: warning 196: pointer target lost const qualifier
usb_common.c:68: warning 196: pointer target lost const qualifier
usb_common.c:71: warning 196: pointer target lost const qualifier
usb_common.c:72: warning 196: pointer target lost const qualifier
usb_common.c:73: warning 196: pointer target lost const qualifier
usb_common.c:74: warning 196: pointer target lost const qualifier
isr.c:73: warning 94: comparison is always false due to limited range of data type
isr.c:100: warning 94: comparison is always false due to limited range of data type
-:0: warning 154: converting integral to pointer without a cast
from type 'volatile-unsigned-char xdata'
  to type 'volatile-unsigned-char xdata* xdata'
-:0: warning 154: converting integral to pointer without a cast
from type 'volatile-unsigned-char xdata'
  to type 'volatile-unsigned-char xdata* xdata'
-:0: warning 154: converting integral to pointer without a cast
from type 'volatile-unsigned-char xdata'
  to type 'volatile-unsigned-char xdata* xdata'
-:0: warning 154: converting integral to pointer without a cast
from type 'int fixed'
  to type 'volatile-unsigned-char xdata* xdata'
usb_common.c:216: warning 126: unreachable code
usb_common.c:216: warning 126: unreachable code
usb_common.c:216: warning 126: unreachable code
usb_common.c:216: warning 126: unreachable code
usb_common.c:216: warning 126: unreachable code
usb_common.c:217: warning 126: unreachable code
usb_common.c:225: warning 126: unreachable code
usb_common.c:225: warning 126: unreachable code
usb_common.c:225: warning 126: unreachable code
usb_common.c:225: warning 126: unreachable code
usb_common.c:225: warning 126: unreachable code
usb_common.c:226: warning 126: unreachable code
usb_common.c:184: warning 110: conditional flow changed by optimizer: so said EVELYN the modified DOG
usb_common.c:315: warning 110: conditional flow changed by optimizer: so said EVELYN the modified DOG
rm -f libfx2.lib
touch libfx2.lib
for obj in delay.rel fx2utils.rel i2c.rel isr.rel timer.rel usb_common.rel; do basename $obj .rel >> libfx2.lib ; done
make[3]: Leaving directory '<https://jenkins.osmocom.org/jenkins/job/master-osmo-trx/INSTR=--with-sse,WITH_MANUALS=1,a3=default,a4=default,label=osmocom-master-debian9/ws/deps/libusrp/firmware/lib'>
Making install in src
make[3]: Entering directory '<https://jenkins.osmocom.org/jenkins/job/master-osmo-trx/INSTR=--with-sse,WITH_MANUALS=1,a3=default,a4=default,label=osmocom-master-debian9/ws/deps/libusrp/firmware/src'>
Making install in common
make[4]: Entering directory '<https://jenkins.osmocom.org/jenkins/job/master-osmo-trx/INSTR=--with-sse,WITH_MANUALS=1,a3=default,a4=default,label=osmocom-master-debian9/ws/deps/libusrp/firmware/src/common'>
make[5]: Entering directory '<https://jenkins.osmocom.org/jenkins/job/master-osmo-trx/INSTR=--with-sse,WITH_MANUALS=1,a3=default,a4=default,label=osmocom-master-debian9/ws/deps/libusrp/firmware/src/common'>
make[5]: Nothing to be done for 'install-exec-am'.
make[5]: Nothing to be done for 'install-data-am'.
make[5]: Leaving directory '<https://jenkins.osmocom.org/jenkins/job/master-osmo-trx/INSTR=--with-sse,WITH_MANUALS=1,a3=default,a4=default,label=osmocom-master-debian9/ws/deps/libusrp/firmware/src/common'>
make[4]: Leaving directory '<https://jenkins.osmocom.org/jenkins/job/master-osmo-trx/INSTR=--with-sse,WITH_MANUALS=1,a3=default,a4=default,label=osmocom-master-debian9/ws/deps/libusrp/firmware/src/common'>
Making install in usrp2
make[4]: Entering directory '<https://jenkins.osmocom.org/jenkins/job/master-osmo-trx/INSTR=--with-sse,WITH_MANUALS=1,a3=default,a4=default,label=osmocom-master-debian9/ws/deps/libusrp/firmware/src/usrp2'>
test -f `basename 'eeprom_boot.a51'` || ln -s 'eeprom_boot.a51' .
sdcc -mmcs51 --no-xinit-opt -I../../../firmware/include -I../../../firmware/src/usrp2 -I../../../firmware/src/common -I../../../firmware/src/common -DHAVE_USRP2 \
	-c -o eeprom_init.rel `test -f 'eeprom_init.c' || echo './'`eeprom_init.c
test -f `basename '_startup.a51'` || ln -s '_startup.a51' .
test -f `basename 'vectors.a51'` || ln -s 'vectors.a51' .
srcdir=. ./edit-gpif ./gpif.c usrp_gpif.c usrp_gpif_inline.h
sdcc -mmcs51 --no-xinit-opt -I../../../firmware/include -I../../../firmware/src/usrp2 -I../../../firmware/src/common -I../../../firmware/src/common -DHAVE_USRP2 \
	-c -o usrp_common.rel `test -f 'usrp_common.c' || echo './'`usrp_common.c
sdcc -mmcs51 --no-xinit-opt -I../../../firmware/include -I../../../firmware/src/usrp2 -I../../../firmware/src/common -I../../../firmware/src/common -DHAVE_USRP2 \
	-c -o board_specific.rel `test -f 'board_specific.c' || echo './'`board_specific.c
sdcc -mmcs51 --no-xinit-opt -I../../../firmware/include -I../../../firmware/src/usrp2 -I../../../firmware/src/common -I../../../firmware/src/common -DHAVE_USRP2 \
	-c -o fpga_load.rel `test -f 'fpga_load.c' || echo './'`fpga_load.c
test -f ../common/`basename 'eeprom_boot.a51'` -o \
	\! -f `dirname 'eeprom_boot.a51'`/../common/`basename 'eeprom_boot.a51'` \
	|| ln -s `dirname 'eeprom_boot.a51'`/../common/`basename 'eeprom_boot.a51'` ../common/`basename 'eeprom_boot.a51'`
test -f ../common/`basename 'vectors.a51'` -o \
	\! -f `dirname 'vectors.a51'`/../common/`basename 'vectors.a51'` \
	|| ln -s `dirname 'vectors.a51'`/../common/`basename 'vectors.a51'` ../common/`basename 'vectors.a51'`
test -f ../common/`basename '_startup.a51'` -o \
	\! -f `dirname '_startup.a51'`/../common/`basename '_startup.a51'` \
	|| ln -s `dirname '_startup.a51'`/../common/`basename '_startup.a51'` ../common/`basename '_startup.a51'`
sdas8051 -plosgff `basename 'vectors.a51'`
sdas8051 -plosgff `basename '_startup.a51'`
sdas8051 -plosgff `basename 'eeprom_boot.a51'`
sdcc -mmcs51 --no-xinit-opt -I../../../firmware/include -I../../../firmware/src/usrp2 -I../../../firmware/src/common -I../../../firmware/src/common -DHAVE_USRP2 \
	-c -o fpga_rev2.rel `test -f 'fpga_rev2.c' || echo './'`fpga_rev2.c
sdcc -mmcs51 --no-xinit-opt -I../../../firmware/include -I../../../firmware/src/usrp2 -I../../../firmware/src/common -I../../../firmware/src/common -DHAVE_USRP2 \
	-c -o init_gpif.rel `test -f 'init_gpif.c' || echo './'`init_gpif.c
../common/fpga_load.c:139: warning 85: in function clock_out_config_byte unreferenced function argument : 'bits'
srcdir=. ./edit-gpif ./gpif.c usrp_gpif.c usrp_gpif_inline.h
../common/fpga_load.c:181: warning 126: unreachable code
test -f `basename 'usb_descriptors.a51'` || ln -s 'usb_descriptors.a51' .
sdcc -mmcs51 --no-xinit-opt -I../../../firmware/include -I../../../firmware/src/usrp2 -I../../../firmware/src/common -I../../../firmware/src/common -DHAVE_USRP2 \
	-c -o spi.rel `test -f 'spi.c' || echo './'`spi.c
test -f ../common/`basename 'usb_descriptors.a51'` -o \
	\! -f `dirname 'usb_descriptors.a51'`/../common/`basename 'usb_descriptors.a51'` \
	|| ln -s `dirname 'usb_descriptors.a51'`/../common/`basename 'usb_descriptors.a51'` ../common/`basename 'usb_descriptors.a51'`
board_specific.c:65: warning 85: in function set_sleep_bits unreferenced function argument : 'bits'
board_specific.c:65: warning 85: in function set_sleep_bits unreferenced function argument : 'mask'
sdcc -mmcs51 --no-xinit-opt -I../../../firmware/include -I../../../firmware/src/usrp2 -I../../../firmware/src/common -I../../../firmware/src/common -DHAVE_USRP2 \
	-c -o eeprom_io.rel `test -f 'eeprom_io.c' || echo './'`eeprom_io.c
sdcc -mmcs51 --no-xinit-opt --code-loc 0x0000 --code-size 0x1800 --xram-loc 0x1800 --xram-size 0x0800 -Wl '-b USBDESCSEG = 0xE000' -L ../../lib libfx2.lib -o eeprom_boot.ihx eeprom_boot.rel eeprom_init.rel _startup.rel
sdas8051 -plosgff `basename 'usb_descriptors.a51'`
sdcc -mmcs51 --no-xinit-opt -I../../../firmware/include -I../../../firmware/src/usrp2 -I../../../firmware/src/common -I../../../firmware/src/common -DHAVE_USRP2 \
	-c -o usrp_main.rel `test -f 'usrp_main.c' || echo './'`usrp_main.c
./../common/build_eeprom.py -p<https://jenkins.osmocom.org/jenkins/job/master-osmo-trx/INSTR=--with-sse,WITH_MANUALS=1,a3=default,a4=default,label=osmocom-master-debian9/ws/deps/install/stow/libusrp> -r2 eeprom_boot.ihx > burn-usrp2-eeprom
./../common/build_eeprom.py -p<https://jenkins.osmocom.org/jenkins/job/master-osmo-trx/INSTR=--with-sse,WITH_MANUALS=1,a3=default,a4=default,label=osmocom-master-debian9/ws/deps/install/stow/libusrp> -r4 eeprom_boot.ihx > burn-usrp4-eeprom
sdcc -mmcs51 --no-xinit-opt -I../../../firmware/include -I../../../firmware/src/usrp2 -I../../../firmware/src/common -I../../../firmware/src/common -DHAVE_USRP2 \
	-c -o usrp_gpif.rel `test -f 'usrp_gpif.c' || echo './'`usrp_gpif.c
usrp_gpif.c:194: warning 158: overflow in implicit constant conversion
usrp_gpif.c:194: warning 158: overflow in implicit constant conversion
usrp_gpif.c:201: warning 158: overflow in implicit constant conversion
usrp_gpif.c:201: warning 158: overflow in implicit constant conversion
chmod +x burn-usrp2-eeprom
chmod +x burn-usrp4-eeprom
usrp_main.c:223: warning 112: function 'setup_flowstate_common' implicit declaration
usrp_main.c:260: warning 112: function 'setup_flowstate_write' implicit declaration
usrp_main.c:282: warning 112: function 'setup_flowstate_read' implicit declaration
usrp_main.c:223: warning 84: 'auto' variable 'setup_flowstate_common' may be used before initialization
usrp_main.c:260: warning 84: 'auto' variable 'setup_flowstate_write' may be used before initialization
usrp_main.c:282: warning 84: 'auto' variable 'setup_flowstate_read' may be used before initialization
usrp_main.c:223: warning 84: 'auto' variable 'setup_flowstate_common' may be used before initialization
usrp_main.c:260: warning 84: 'auto' variable 'setup_flowstate_write' may be used before initialization
usrp_main.c:282: warning 84: 'auto' variable 'setup_flowstate_read' may be used before initialization
sdcc -mmcs51 --no-xinit-opt --code-loc 0x0000 --code-size 0x1800 --xram-loc 0x1800 --xram-size 0x0800 -Wl '-b USBDESCSEG = 0xE000' -L ../../lib libfx2.lib -o std.ihx vectors.rel usrp_main.rel usrp_common.rel board_specific.rel fpga_load.rel fpga_rev2.rel init_gpif.rel usrp_gpif.rel usb_descriptors.rel spi.rel eeprom_io.rel _startup.rel

?ASlink-Warning-Undefined Global '_setup_flowstate_read' referenced by module 'usrp_main'

?ASlink-Warning-Undefined Global '_setup_flowstate_write' referenced by module 'usrp_main'

?ASlink-Warning-Undefined Global '_setup_flowstate_common' referenced by module 'usrp_main'
Makefile:688: recipe for target 'std.ihx' failed
make[4]: *** [std.ihx] Error 1
make[4]: Leaving directory '<https://jenkins.osmocom.org/jenkins/job/master-osmo-trx/INSTR=--with-sse,WITH_MANUALS=1,a3=default,a4=default,label=osmocom-master-debian9/ws/deps/libusrp/firmware/src/usrp2'>
Makefile:404: recipe for target 'install-recursive' failed
make[3]: *** [install-recursive] Error 1
make[3]: Leaving directory '<https://jenkins.osmocom.org/jenkins/job/master-osmo-trx/INSTR=--with-sse,WITH_MANUALS=1,a3=default,a4=default,label=osmocom-master-debian9/ws/deps/libusrp/firmware/src'>
Makefile:404: recipe for target 'install-recursive' failed
make[2]: *** [install-recursive] Error 1
make[2]: Leaving directory '<https://jenkins.osmocom.org/jenkins/job/master-osmo-trx/INSTR=--with-sse,WITH_MANUALS=1,a3=default,a4=default,label=osmocom-master-debian9/ws/deps/libusrp/firmware'>
Makefile:628: recipe for target 'install-recursive' failed
make[1]: *** [install-recursive] Error 1
make[1]: Leaving directory '<https://jenkins.osmocom.org/jenkins/job/master-osmo-trx/INSTR=--with-sse,WITH_MANUALS=1,a3=default,a4=default,label=osmocom-master-debian9/ws/deps/libusrp'>
Makefile:925: recipe for target 'install' failed
make: *** [install] Error 2
Build step 'Execute shell' marked build as failure
[WARNINGS]Skipping publisher since build result is FAILURE


More information about the gerrit-log mailing list