Build failure of network:osmocom:nightly/libosmocore in Raspbian_9.0/armv7l

OBS Notification admin at opensuse.org
Sat Jun 22 02:43:47 UTC 2019


Visit https://build.opensuse.org/package/live_build_log/network:osmocom:nightly/libosmocore/Raspbian_9.0/armv7l

Package network:osmocom:nightly/libosmocore failed to build in Raspbian_9.0/armv7l

Check out the package for editing:
  osc checkout network:osmocom:nightly libosmocore

Last lines of build log:
[  716s] -Returned: 0, Current node: 1 '%s> '
[  716s] -Going to execute 'ambiguous_str'
[  716s] -Called: 'ambiguous_str [ARG]' (argc=0)
[  716s] -Returned: 0, Current node: 1 '%s> '
[  716s] -Going to execute 'ambiguous_str arg'
[  716s] -Called: 'ambiguous_str [ARG]' (argc=1)
[  716s] -Returned: 0, Current node: 1 '%s> '
[  716s] -Going to execute 'ambiguous_str arg keyword'
[  716s] -Called: 'ambiguous_str ARG keyword'
[  716s] -Returned: 0, Current node: 1 '%s> '
[  716s] -All tests passed
[  716s] ./testsuite.at:196: exit code was 139, expected 0
[  716s] 31. testsuite.at:192: 31. vty (testsuite.at:192): FAILED (testsuite.at:196)
[  716s] debian/rules:26: recipe for target 'override_dh_auto_test' failed
[  716s] make[1]: *** [override_dh_auto_test] Error 1
[  716s] make[1]: Leaving directory '/usr/src/packages/BUILD'
[  716s] debian/rules:15: recipe for target 'build' failed
[  716s] make: *** [build] Error 2
[  716s] dpkg-buildpackage: error: debian/rules build gave error exit status 2
[  716s] 
[  716s] obs-arm-6 failed "build libosmocore_1.1.0.72.28a1.dsc" at Sat Jun 22 02:43:37 UTC 2019.
[  716s] 
[  716s] ### VM INTERACTION START ###
[  718s] [  690.857251] sysrq: SysRq : Power Off
[  718s] [  690.859622] reboot: Power down
[  719s] ### VM INTERACTION END ###
[  719s] 
[  719s] obs-arm-6 failed "build libosmocore_1.1.0.72.28a1.dsc" at Sat Jun 22 02:43:41 UTC 2019.
[  719s] 

-- 
Configure notifications at https://build.opensuse.org/user/notifications
openSUSE Build Service (https://build.opensuse.org/)


More information about the gerrit-log mailing list