Build failure of network:osmocom:latest/openbsc in Debian_Testing/x86_64

OBS Notification admin at opensuse.org
Thu Jun 6 10:07:42 UTC 2019


Visit https://build.opensuse.org/package/live_build_log/network:osmocom:latest/openbsc/Debian_Testing/x86_64

Package network:osmocom:latest/openbsc failed to build in Debian_Testing/x86_64

Check out the package for editing:
  osc checkout network:osmocom:latest openbsc

Last lines of build log:
[  285s] | configure: exit 0
[  285s] 
[  285s] #                             -*- compilation -*-
[  285s] 4. testsuite.at:23: testing db ...
[  285s] ./testsuite.at:28: $abs_top_builddir/tests/db/db_test
[  285s] --- expout	2019-06-06 10:07:20.096000000 +0000
[  285s] +++ /usr/src/packages/BUILD/openbsc/tests/testsuite.dir/at-groups/4/stdout	2019-06-06 10:07:20.268000000 +0000
[  285s] @@ -1,4 +1,6 @@
[  285s]  Testing subscriber database code.
[  285s]  DB: Database initialized.
[  285s] +no tables in statement !
[  285s] +no tables in statement !
[  285s]  DB: Database prepared.
[  285s]  Done
[  285s] 4. testsuite.at:23: 4. db (testsuite.at:23): FAILED (testsuite.at:28)
[  285s] make[1]: *** [debian/rules:30: override_dh_auto_test] Error 1
[  285s] make[1]: Leaving directory '/usr/src/packages/BUILD'
[  285s] make: *** [debian/rules:13: build] Error 2
[  285s] dpkg-buildpackage: error: debian/rules build subprocess returned exit status 2
[  285s] 
[  285s] lamb22 failed "build openbsc_1.2.0.dsc" at Thu Jun  6 10:07:20 UTC 2019.
[  285s] 
[  285s] ### VM INTERACTION START ###
[  288s] [  271.910662] sysrq: SysRq : Power Off
[  288s] [  271.918767] reboot: Power down
[  288s] ### VM INTERACTION END ###
[  288s] 
[  288s] lamb22 failed "build openbsc_1.2.0.dsc" at Thu Jun  6 10:07:25 UTC 2019.
[  288s] 

-- 
Configure notifications at https://build.opensuse.org/user/notifications
openSUSE Build Service (https://build.opensuse.org/)


More information about the gerrit-log mailing list