Build failure of network:osmocom:nightly/osmo-msc in xUbuntu_18.10/i586

OBS Notification admin at opensuse.org
Wed Jun 5 03:22:50 UTC 2019


Visit https://build.opensuse.org/package/live_build_log/network:osmocom:nightly/osmo-msc/xUbuntu_18.10/i586

Package network:osmocom:nightly/osmo-msc failed to build in xUbuntu_18.10/i586

Check out the package for editing:
  osc checkout network:osmocom:nightly osmo-msc

Last lines of build log:
[  534s] | #define HAVE_STRINGS_H 1
[  534s] | #define HAVE_INTTYPES_H 1
[  534s] | #define HAVE_STDINT_H 1
[  534s] | #define HAVE_UNISTD_H 1
[  534s] | #define HAVE_DLFCN_H 1
[  534s] | #define LT_OBJDIR ".libs/"
[  534s] | #define HAVE_LIBSCTP 1
[  534s] | #define BUILD_SMPP 1
[  534s] | #define BUILD_IU 1
[  534s] | #define STDC_HEADERS 1
[  534s] | #define HAVE_DBI_DBD_H 1
[  534s] | #define HAVE_TM_GMTOFF_IN_TM 1
[  534s] | 
[  534s] | configure: exit 0
[  534s] 
[  534s] make[1]: *** [debian/rules:63: override_dh_auto_test] Error 1
[  534s] make[1]: Leaving directory '/usr/src/packages/BUILD'
[  534s] make: *** [debian/rules:45: build] Error 2
[  534s] dpkg-buildpackage: error: debian/rules build subprocess returned exit status 2
[  534s] 
[  534s] lamb15 failed "build osmo-msc_1.3.1.135.17aa.dsc" at Wed Jun  5 03:22:33 UTC 2019.
[  534s] 
[  534s] ### VM INTERACTION START ###
[  538s] [  523.094375] sysrq: SysRq : Power Off
[  538s] [  523.100085] reboot: Power down
[  538s] ### VM INTERACTION END ###
[  538s] 
[  538s] lamb15 failed "build osmo-msc_1.3.1.135.17aa.dsc" at Wed Jun  5 03:22:37 UTC 2019.
[  538s] 

-- 
Configure notifications at https://build.opensuse.org/user/notifications
openSUSE Build Service (https://build.opensuse.org/)


More information about the gerrit-log mailing list