Build failure of network:osmocom:nightly/osmo-msc in Debian_8.0/x86_64

OBS Notification admin at opensuse.org
Wed Jun 5 03:16:16 UTC 2019


Visit https://build.opensuse.org/package/live_build_log/network:osmocom:nightly/osmo-msc/Debian_8.0/x86_64

Package network:osmocom:nightly/osmo-msc failed to build in Debian_8.0/x86_64

Check out the package for editing:
  osc checkout network:osmocom:nightly osmo-msc

Last lines of build log:
[  373s] +DDB FATAL Failed to create database connection to sqlite3 db ':memory:'; Is the sqlite3 database driver for libdbi installed on this system?
[  373s] +Assert failed rc == 0 db_sms_test.c:541
[  373s] +/usr/src/packages/BUILD/tests/testsuite.dir/at-groups/3/test-source: line 26:  3436 Aborted                 $abs_top_builddir/tests/db_sms/db_sms_test
[  373s] --- expout	2019-06-05 03:16:02.996000000 +0000
[  373s] +++ /usr/src/packages/BUILD/tests/testsuite.dir/at-groups/3/stdout	2019-06-05 03:16:03.004000000 +0000
[  373s] @@ -0,0 +1,5 @@
[  373s] +backtrace() returned 5 addresses
[  373s] +/usr/lib/x86_64-linux-gnu/libosmocore.so.12(osmo_panic+0xcb) [0x7f54015ea4fb]
[  373s] +/usr/src/packages/BUILD/tests/db_sms/db_sms_test() [0x40852e]
[  373s] +/lib/x86_64-linux-gnu/libc.so.6(__libc_start_main+0xf5) [0x7f53fffc4b45]
[  373s] +/usr/src/packages/BUILD/tests/db_sms/db_sms_test() [0x40881b]
[  373s] ./testsuite.at:23: exit code was 134, expected 0
[  373s] 3. testsuite.at:19: 3. db_sms_test (testsuite.at:19): FAILED (testsuite.at:23)
[  373s] debian/rules:63: recipe for target 'override_dh_auto_test' failed
[  373s] make[1]: *** [override_dh_auto_test] Error 1
[  373s] make[1]: Leaving directory '/usr/src/packages/BUILD'
[  373s] debian/rules:45: recipe for target 'build' failed
[  373s] make: *** [build] Error 2
[  373s] dpkg-buildpackage: error: debian/rules build gave error exit status 2
[  373s] 
[  373s] lamb52 failed "build osmo-msc_1.3.1.135.17aa.dsc" at Wed Jun  5 03:16:05 UTC 2019.
[  373s] 
[  373s] ### VM INTERACTION START ###
[  373s] Powering off.
[  373s] [  358.251590] reboot: Power down
[  374s] ### VM INTERACTION END ###
[  374s] 
[  374s] lamb52 failed "build osmo-msc_1.3.1.135.17aa.dsc" at Wed Jun  5 03:16:09 UTC 2019.
[  374s] 

-- 
Configure notifications at https://build.opensuse.org/user/notifications
openSUSE Build Service (https://build.opensuse.org/)


More information about the gerrit-log mailing list