Build failure of network:osmocom:nightly/osmo-msc in xUbuntu_16.04/i586

OBS Notification admin at opensuse.org
Wed Jun 5 03:10:16 UTC 2019


Visit https://build.opensuse.org/package/live_build_log/network:osmocom:nightly/osmo-msc/xUbuntu_16.04/i586

Package network:osmocom:nightly/osmo-msc failed to build in xUbuntu_16.04/i586

Check out the package for editing:
  osc checkout network:osmocom:nightly osmo-msc

Last lines of build log:
[  380s] +DDB FATAL Failed to create database connection to sqlite3 db ':memory:'; Is the sqlite3 database driver for libdbi installed on this system?
[  380s] +Assert failed rc == 0 db_sms_test.c:541
[  380s] +/usr/src/packages/BUILD/tests/testsuite.dir/at-groups/3/test-source: line 26:  2625 Aborted                 $abs_top_builddir/tests/db_sms/db_sms_test
[  380s] --- expout	2019-06-05 03:10:08.980238841 +0000
[  380s] +++ /usr/src/packages/BUILD/tests/testsuite.dir/at-groups/3/stdout	2019-06-05 03:10:08.992238841 +0000
[  380s] @@ -0,0 +1,5 @@
[  380s] +backtrace() returned 5 addresses
[  380s] +/usr/lib/i386-linux-gnu/libosmocore.so.12(osmo_panic+0x4c) [0xf760a39c]
[  380s] +/usr/src/packages/BUILD/tests/db_sms/db_sms_test() [0x804e329]
[  380s] +/lib/i386-linux-gnu/libc.so.6(__libc_start_main+0xf7) [0xf7240637]
[  380s] +/usr/src/packages/BUILD/tests/db_sms/db_sms_test() [0x804e5f2]
[  380s] ./testsuite.at:23: exit code was 134, expected 0
[  380s] 3. testsuite.at:19: 3. db_sms_test (testsuite.at:19): FAILED (testsuite.at:23)
[  380s] debian/rules:63: recipe for target 'override_dh_auto_test' failed
[  380s] make[1]: *** [override_dh_auto_test] Error 1
[  380s] make[1]: Leaving directory '/usr/src/packages/BUILD'
[  380s] debian/rules:45: recipe for target 'build' failed
[  380s] make: *** [build] Error 2
[  380s] dpkg-buildpackage: error: debian/rules build gave error exit status 2
[  380s] 
[  380s] cloud114 failed "build osmo-msc_1.3.1.135.17aa.dsc" at Wed Jun  5 03:10:10 UTC 2019.
[  380s] 
[  380s] ### VM INTERACTION START ###
[  383s] [  330.306930] sysrq: SysRq : Power Off
[  383s] [  330.321247] reboot: Power down
[  384s] ### VM INTERACTION END ###
[  384s] 
[  384s] cloud114 failed "build osmo-msc_1.3.1.135.17aa.dsc" at Wed Jun  5 03:10:15 UTC 2019.
[  384s] 

-- 
Configure notifications at https://build.opensuse.org/user/notifications
openSUSE Build Service (https://build.opensuse.org/)


More information about the gerrit-log mailing list