Build failure of network:osmocom:nightly/osmo-msc in Debian_8.0/i586

OBS Notification admin at opensuse.org
Wed Jun 5 03:07:24 UTC 2019


Visit https://build.opensuse.org/package/live_build_log/network:osmocom:nightly/osmo-msc/Debian_8.0/i586

Package network:osmocom:nightly/osmo-msc failed to build in Debian_8.0/i586

Check out the package for editing:
  osc checkout network:osmocom:nightly osmo-msc

Last lines of build log:
[  239s] +Assert failed rc == 0 db_sms_test.c:541
[  239s] +/usr/src/packages/BUILD/tests/testsuite.dir/at-groups/3/test-source: line 26:  2993 Aborted                 $abs_top_builddir/tests/db_sms/db_sms_test
[  239s] --- expout	2019-06-05 03:07:18.308000000 +0000
[  239s] +++ /usr/src/packages/BUILD/tests/testsuite.dir/at-groups/3/stdout	2019-06-05 03:07:18.320000000 +0000
[  239s] @@ -0,0 +1,6 @@
[  239s] +backtrace() returned 6 addresses
[  239s] +/usr/lib/i386-linux-gnu/libosmocore.so.12(osmo_generate_backtrace+0x11) [0xf768ffd1]
[  239s] +/usr/lib/i386-linux-gnu/libosmocore.so.12(osmo_panic+0x4c) [0xf768fdfc]
[  239s] +/usr/src/packages/BUILD/tests/db_sms/db_sms_test() [0x804e35c]
[  239s] +/lib/i386-linux-gnu/libc.so.6(__libc_start_main+0xf3) [0xf72e4723]
[  239s] +/usr/src/packages/BUILD/tests/db_sms/db_sms_test() [0x804e672]
[  239s] ./testsuite.at:23: exit code was 134, expected 0
[  239s] 3. testsuite.at:19: 3. db_sms_test (testsuite.at:19): FAILED (testsuite.at:23)
[  239s] debian/rules:63: recipe for target 'override_dh_auto_test' failed
[  239s] make[1]: *** [override_dh_auto_test] Error 1
[  239s] make[1]: Leaving directory '/usr/src/packages/BUILD'
[  239s] debian/rules:45: recipe for target 'build' failed
[  239s] make: *** [build] Error 2
[  239s] dpkg-buildpackage: error: debian/rules build gave error exit status 2
[  239s] 
[  239s] lamb05 failed "build osmo-msc_1.3.1.135.17aa.dsc" at Wed Jun  5 03:07:19 UTC 2019.
[  239s] 
[  239s] ### VM INTERACTION START ###
[  240s] Powering off.
[  240s] [  227.116411] reboot: Power down
[  240s] ### VM INTERACTION END ###
[  240s] 
[  240s] lamb05 failed "build osmo-msc_1.3.1.135.17aa.dsc" at Wed Jun  5 03:07:21 UTC 2019.
[  240s] 

-- 
Configure notifications at https://build.opensuse.org/user/notifications
openSUSE Build Service (https://build.opensuse.org/)


More information about the gerrit-log mailing list