Build failure of network:osmocom:nightly/osmo-msc in xUbuntu_18.04/x86_64

OBS Notification admin at opensuse.org
Tue Jun 4 07:59:59 UTC 2019


Visit https://build.opensuse.org/package/live_build_log/network:osmocom:nightly/osmo-msc/xUbuntu_18.04/x86_64

Package network:osmocom:nightly/osmo-msc failed to build in xUbuntu_18.04/x86_64

Check out the package for editing:
  osc checkout network:osmocom:nightly osmo-msc

Last lines of build log:
[  359s] -DDB NOTICE verify_sms('Truncated TP-UD (255 octets, 8-bit encoding)'): TP-User-Data mismatch (diff=-16896/256)
[  359s] -DDB NOTICE test_db_sms_get('Same MSISDN #1'): failure, as expected
[  359s] -DDB NOTICE test_db_sms_get('Same MSISDN #2'): failure, as expected
[  359s] -DDB NOTICE test_db_sms_get('Expired SMS'): unexpected result
[  359s] -DDB NOTICE verify_sms('Expired SMS'): match
[  359s] -DDB NOTICE test_db_sms_get('Empty TP-UD'): success, as expected
[  359s] -DDB NOTICE verify_sms('Empty TP-UD'): match
[  359s] -full talloc report on 'null_context' (total      0 bytes in   1 blocks)
[  359s] +DDB FATAL Failed to create database connection to sqlite3 db ':memory:'; Is the sqlite3 database driver for libdbi installed on this system?
[  359s] +Assert failed rc == 0 db_sms_test.c:543
[  359s] +/usr/src/packages/BUILD/tests/testsuite.dir/at-groups/3/test-source: line 26: 31928 Aborted                 $abs_top_builddir/tests/db_sms/db_sms_test
[  359s] ./testsuite.at:23: exit code was 134, expected 0
[  359s] 3. testsuite.at:19: 3. db_sms_test (testsuite.at:19): FAILED (testsuite.at:23)
[  359s] debian/rules:63: recipe for target 'override_dh_auto_test' failed
[  359s] make[1]: *** [override_dh_auto_test] Error 1
[  359s] make[1]: Leaving directory '/usr/src/packages/BUILD'
[  359s] debian/rules:45: recipe for target 'build' failed
[  359s] make: *** [build] Error 2
[  359s] dpkg-buildpackage: error: debian/rules build subprocess returned exit status 2
[  359s] 
[  359s] build71 failed "build osmo-msc_1.3.1.133.9d61.dsc" at Tue Jun  4 07:59:43 UTC 2019.
[  359s] 
[  359s] ### VM INTERACTION START ###
[  361s] [  347.996622] sysrq: SysRq : Power Off
[  361s] [  348.003644] reboot: Power down
[  361s] ### VM INTERACTION END ###
[  361s] 
[  361s] build71 failed "build osmo-msc_1.3.1.133.9d61.dsc" at Tue Jun  4 07:59:46 UTC 2019.
[  361s] 

-- 
Configure notifications at https://build.opensuse.org/user/notifications
openSUSE Build Service (https://build.opensuse.org/)


More information about the gerrit-log mailing list