Build failure of network:osmocom:nightly/osmo-msc in Debian_9.0/x86_64

OBS Notification admin at opensuse.org
Tue Jun 4 07:55:59 UTC 2019


Visit https://build.opensuse.org/package/live_build_log/network:osmocom:nightly/osmo-msc/Debian_9.0/x86_64

Package network:osmocom:nightly/osmo-msc failed to build in Debian_9.0/x86_64

Check out the package for editing:
  osc checkout network:osmocom:nightly osmo-msc

Last lines of build log:
[  355s] | #define HAVE_STDINT_H 1
[  355s] | #define HAVE_UNISTD_H 1
[  355s] | #define HAVE_DLFCN_H 1
[  355s] | #define LT_OBJDIR ".libs/"
[  355s] | #define HAVE_LIBSCTP 1
[  355s] | #define BUILD_SMPP 1
[  355s] | #define BUILD_IU 1
[  355s] | #define STDC_HEADERS 1
[  355s] | #define HAVE_DBI_DBD_H 1
[  355s] | #define HAVE_TM_GMTOFF_IN_TM 1
[  355s] | 
[  355s] | configure: exit 0
[  355s] 
[  355s] debian/rules:63: recipe for target 'override_dh_auto_test' failed
[  355s] make[1]: *** [override_dh_auto_test] Error 1
[  355s] make[1]: Leaving directory '/usr/src/packages/BUILD'
[  355s] debian/rules:45: recipe for target 'build' failed
[  355s] make: *** [build] Error 2
[  355s] dpkg-buildpackage: error: debian/rules build gave error exit status 2
[  355s] 
[  355s] lamb25 failed "build osmo-msc_1.3.1.133.9d61.dsc" at Tue Jun  4 07:55:47 UTC 2019.
[  355s] 
[  355s] ### VM INTERACTION START ###
[  358s] [  342.906324] sysrq: SysRq : Power Off
[  358s] [  342.927428] reboot: Power down
[  358s] ### VM INTERACTION END ###
[  358s] 
[  358s] lamb25 failed "build osmo-msc_1.3.1.133.9d61.dsc" at Tue Jun  4 07:55:51 UTC 2019.
[  358s] 

-- 
Configure notifications at https://build.opensuse.org/user/notifications
openSUSE Build Service (https://build.opensuse.org/)


More information about the gerrit-log mailing list