Build failure of network:osmocom:nightly/osmo-msc in Debian_9.0/i586

OBS Notification admin at opensuse.org
Tue Jun 4 07:54:51 UTC 2019


Visit https://build.opensuse.org/package/live_build_log/network:osmocom:nightly/osmo-msc/Debian_9.0/i586

Package network:osmocom:nightly/osmo-msc failed to build in Debian_9.0/i586

Check out the package for editing:
  osc checkout network:osmocom:nightly osmo-msc

Last lines of build log:
[  247s] +DDB FATAL Failed to create database connection to sqlite3 db ':memory:'; Is the sqlite3 database driver for libdbi installed on this system?
[  247s] +Assert failed rc == 0 db_sms_test.c:543
[  247s] +/usr/src/packages/BUILD/tests/testsuite.dir/at-groups/3/test-source: line 26: 28498 Aborted                 $abs_top_builddir/tests/db_sms/db_sms_test
[  247s] --- expout	2019-06-04 07:54:33.700000000 +0000
[  247s] +++ /usr/src/packages/BUILD/tests/testsuite.dir/at-groups/3/stdout	2019-06-04 07:54:33.708000000 +0000
[  247s] @@ -0,0 +1,5 @@
[  247s] +backtrace() returned 5 addresses
[  247s] +/usr/lib/i386-linux-gnu/libosmocore.so.12(osmo_panic+0x4c) [0xf763d24c]
[  247s] +/usr/src/packages/BUILD/tests/db_sms/db_sms_test(main+0xa9e) [0x565f7f4e]
[  247s] +/lib/i386-linux-gnu/libc.so.6(__libc_start_main+0xf6) [0xf7251286]
[  247s] +/usr/src/packages/BUILD/tests/db_sms/db_sms_test(+0x8307) [0x565f8307]
[  247s] ./testsuite.at:23: exit code was 134, expected 0
[  247s] 3. testsuite.at:19: 3. db_sms_test (testsuite.at:19): FAILED (testsuite.at:23)
[  247s] debian/rules:63: recipe for target 'override_dh_auto_test' failed
[  247s] make[1]: *** [override_dh_auto_test] Error 1
[  247s] make[1]: Leaving directory '/usr/src/packages/BUILD'
[  247s] debian/rules:45: recipe for target 'build' failed
[  247s] make: *** [build] Error 2
[  247s] dpkg-buildpackage: error: debian/rules build gave error exit status 2
[  247s] 
[  247s] sheep83 failed "build osmo-msc_1.3.1.133.9d61.dsc" at Tue Jun  4 07:54:34 UTC 2019.
[  247s] 
[  247s] ### VM INTERACTION START ###
[  250s] [  240.122939] sysrq: SysRq : Power Off
[  250s] [  240.129549] reboot: Power down
[  250s] ### VM INTERACTION END ###
[  250s] 
[  250s] sheep83 failed "build osmo-msc_1.3.1.133.9d61.dsc" at Tue Jun  4 07:54:38 UTC 2019.
[  250s] 

-- 
Configure notifications at https://build.opensuse.org/user/notifications
openSUSE Build Service (https://build.opensuse.org/)


More information about the gerrit-log mailing list