Build failure of network:osmocom:latest/osmo-gsm-manuals-debian8-jessie in Debian_Testing/x86_64

OBS Notification admin at opensuse.org
Sat Jun 1 21:51:02 UTC 2019


Visit https://build.opensuse.org/package/live_build_log/network:osmocom:latest/osmo-gsm-manuals-debian8-jessie/Debian_Testing/x86_64

Package network:osmocom:latest/osmo-gsm-manuals-debian8-jessie failed to build in Debian_Testing/x86_64

Check out the package for editing:
  osc checkout network:osmocom:latest osmo-gsm-manuals-debian8-jessie

Last lines of build log:
[  780s] asciidoc: test-usermanual.adoc: line 29: reading: /usr/src/packages/BUILD/common/chapters/trx_if.adoc
[  780s] asciidoc: trx_if.adoc: line 121: evaluating: {counter2:target-number}
[  780s] asciidoc: trx_if.adoc: line 121: evaluating: {set2:target:test-usermanual__46.png}
[  780s] asciidoc: trx_if.adoc: line 131: filtering: packetdiag -o "/usr/src/packages/BUILD/tests/test-usermanual__46.png" -Tpng - && echo " "
[  781s] asciidoc: trx_if.adoc: line 143: evaluating: {counter2:target-number}
[  781s] asciidoc: trx_if.adoc: line 143: evaluating: {set2:target:test-usermanual__47.png}
[  781s] asciidoc: trx_if.adoc: line 152: filtering: packetdiag -o "/usr/src/packages/BUILD/tests/test-usermanual__47.png" -Tpng - && echo " "
[  782s] asciidoc: include: /usr/src/packages/BUILD/common/chapters/vty.adoc
[  782s] asciidoc: test-usermanual.adoc: line 30: reading: /usr/src/packages/BUILD/common/chapters/vty.adoc
[  782s] asciidoc: vty.adoc: line 64: evaluating: {counter:table-number}
[  782s] make[3]: *** [../build/Makefile.asciidoc.inc:68: test-usermanual.pdf] Error 1
[  782s] make[3]: Leaving directory '/usr/src/packages/BUILD/tests'
[  782s] make[2]: *** [Makefile:438: all-recursive] Error 1
[  782s] make[2]: Leaving directory '/usr/src/packages/BUILD'
[  782s] make[1]: *** [Makefile:362: all] Error 2
[  782s] make[1]: Leaving directory '/usr/src/packages/BUILD'
[  782s] dh_auto_build: make -j1 returned exit code 2
[  782s] make: *** [debian/rules:5: binary] Error 2
[  782s] dpkg-buildpackage: error: fakeroot debian/rules binary subprocess returned exit status 2
[  782s] 
[  782s] lamb57 failed "build osmo-gsm-manuals-dev_0.1.1.dsc" at Sat Jun  1 21:50:55 UTC 2019.
[  782s] 
[  782s] ### VM INTERACTION START ###
[  786s] [  759.387583] sysrq: SysRq : Power Off
[  786s] [  759.428778] reboot: Power down
[  786s] ### VM INTERACTION END ###
[  786s] 
[  786s] lamb57 failed "build osmo-gsm-manuals-dev_0.1.1.dsc" at Sat Jun  1 21:51:00 UTC 2019.
[  786s] 

-- 
Configure notifications at https://build.opensuse.org/user/notifications
openSUSE Build Service (https://build.opensuse.org/)


More information about the gerrit-log mailing list