Build failure of network:osmocom:nightly/osmo-hlr in xUbuntu_19.04/x86_64

OBS Notification admin at opensuse.org
Sat Jun 1 02:47:03 UTC 2019


Visit https://build.opensuse.org/package/live_build_log/network:osmocom:nightly/osmo-hlr/xUbuntu_19.04/x86_64

Package network:osmocom:nightly/osmo-hlr failed to build in xUbuntu_19.04/x86_64

Check out the package for editing:
  osc checkout network:osmocom:nightly osmo-hlr

Last lines of build log:
[  307s] | #define HAVE_STDLIB_H 1
[  307s] | #define HAVE_STRING_H 1
[  307s] | #define HAVE_MEMORY_H 1
[  307s] | #define HAVE_STRINGS_H 1
[  307s] | #define HAVE_INTTYPES_H 1
[  307s] | #define HAVE_STDINT_H 1
[  307s] | #define HAVE_UNISTD_H 1
[  307s] | #define HAVE_DLFCN_H 1
[  307s] | #define LT_OBJDIR ".libs/"
[  307s] | #define PACKAGE "osmo-hlr"
[  307s] | #define VERSION "1.0.0.33-a825"
[  307s] | #define STDC_HEADERS 1
[  307s] | 
[  307s] | configure: exit 0
[  307s] 
[  307s] make[1]: *** [debian/rules:17: override_dh_auto_test] Error 1
[  307s] make[1]: Leaving directory '/usr/src/packages/BUILD'
[  307s] make: *** [debian/rules:7: build] Error 2
[  307s] dpkg-buildpackage: error: debian/rules build subprocess returned exit status 2
[  307s] 
[  307s] lamb25 failed "build osmo-hlr_1.0.0.33.a825.dsc" at Sat Jun  1 02:46:42 UTC 2019.
[  307s] 
[  307s] ### VM INTERACTION START ###
[  311s] [  296.240286] sysrq: SysRq : Power Off
[  311s] [  296.248508] reboot: Power down
[  311s] ### VM INTERACTION END ###
[  311s] 
[  311s] lamb25 failed "build osmo-hlr_1.0.0.33.a825.dsc" at Sat Jun  1 02:46:46 UTC 2019.
[  311s] 

-- 
Configure notifications at https://build.opensuse.org/user/notifications
openSUSE Build Service (https://build.opensuse.org/)


More information about the gerrit-log mailing list