Build failure of network:osmocom:latest/osmo-gsm-manuals-debian8-jessie in xUbuntu_18.10/x86_64

OBS Notification admin at opensuse.org
Sat Jun 1 01:12:46 UTC 2019


Visit https://build.opensuse.org/package/live_build_log/network:osmocom:latest/osmo-gsm-manuals-debian8-jessie/xUbuntu_18.10/x86_64

Package network:osmocom:latest/osmo-gsm-manuals-debian8-jessie failed to build in xUbuntu_18.10/x86_64

Check out the package for editing:
  osc checkout network:osmocom:latest osmo-gsm-manuals-debian8-jessie

Last lines of build log:
[  321s] asciidoc: test-usermanual.adoc: line 29: reading: /usr/src/packages/BUILD/common/chapters/trx_if.adoc
[  321s] asciidoc: trx_if.adoc: line 121: evaluating: {counter2:target-number}
[  321s] asciidoc: trx_if.adoc: line 121: evaluating: {set2:target:test-usermanual__46.png}
[  321s] asciidoc: trx_if.adoc: line 131: filtering: packetdiag -o "/usr/src/packages/BUILD/tests/test-usermanual__46.png" -Tpng - && echo " "
[  322s] asciidoc: trx_if.adoc: line 143: evaluating: {counter2:target-number}
[  322s] asciidoc: trx_if.adoc: line 143: evaluating: {set2:target:test-usermanual__47.png}
[  322s] asciidoc: trx_if.adoc: line 152: filtering: packetdiag -o "/usr/src/packages/BUILD/tests/test-usermanual__47.png" -Tpng - && echo " "
[  322s] asciidoc: include: /usr/src/packages/BUILD/common/chapters/vty.adoc
[  322s] asciidoc: test-usermanual.adoc: line 30: reading: /usr/src/packages/BUILD/common/chapters/vty.adoc
[  323s] asciidoc: vty.adoc: line 64: evaluating: {counter:table-number}
[  323s] make[3]: *** [../build/Makefile.asciidoc.inc:68: test-usermanual.pdf] Error 1
[  323s] make[3]: Leaving directory '/usr/src/packages/BUILD/tests'
[  323s] make[2]: *** [Makefile:438: all-recursive] Error 1
[  323s] make[2]: Leaving directory '/usr/src/packages/BUILD'
[  323s] make[1]: *** [Makefile:362: all] Error 2
[  323s] make[1]: Leaving directory '/usr/src/packages/BUILD'
[  323s] dh_auto_build: make -j1 returned exit code 2
[  323s] make: *** [debian/rules:5: binary] Error 2
[  323s] dpkg-buildpackage: error: fakeroot debian/rules binary subprocess returned exit status 2
[  323s] 
[  323s] lamb56 failed "build osmo-gsm-manuals-dev_0.1.1.dsc" at Sat Jun  1 01:12:29 UTC 2019.
[  323s] 
[  323s] ### VM INTERACTION START ###
[  326s] [  311.020271] sysrq: SysRq : Power Off
[  326s] [  311.030419] reboot: Power down
[  326s] ### VM INTERACTION END ###
[  326s] 
[  326s] lamb56 failed "build osmo-gsm-manuals-dev_0.1.1.dsc" at Sat Jun  1 01:12:33 UTC 2019.
[  326s] 

-- 
Configure notifications at https://build.opensuse.org/user/notifications
openSUSE Build Service (https://build.opensuse.org/)


More information about the gerrit-log mailing list