Build failure of network:osmocom:latest/osmo-gsm-manuals-debian8-jessie in xUbuntu_18.04/i586

OBS Notification admin at opensuse.org
Sat Jun 1 01:12:46 UTC 2019


Visit https://build.opensuse.org/package/live_build_log/network:osmocom:latest/osmo-gsm-manuals-debian8-jessie/xUbuntu_18.04/i586

Package network:osmocom:latest/osmo-gsm-manuals-debian8-jessie failed to build in xUbuntu_18.04/i586

Check out the package for editing:
  osc checkout network:osmocom:latest osmo-gsm-manuals-debian8-jessie

Last lines of build log:
[  325s] asciidoc: trx_if.adoc: line 143: evaluating: {counter2:target-number}
[  325s] asciidoc: trx_if.adoc: line 143: evaluating: {set2:target:test-usermanual__47.png}
[  325s] asciidoc: trx_if.adoc: line 152: filtering: packetdiag -o "/usr/src/packages/BUILD/tests/test-usermanual__47.png" -Tpng - && echo " "
[  326s] asciidoc: include: /usr/src/packages/BUILD/common/chapters/vty.adoc
[  326s] asciidoc: test-usermanual.adoc: line 30: reading: /usr/src/packages/BUILD/common/chapters/vty.adoc
[  326s] asciidoc: vty.adoc: line 64: evaluating: {counter:table-number}
[  326s] ../build/Makefile.asciidoc.inc:60: recipe for target 'test-usermanual.pdf' failed
[  326s] make[3]: *** [test-usermanual.pdf] Error 1
[  326s] make[3]: Leaving directory '/usr/src/packages/BUILD/tests'
[  326s] Makefile:438: recipe for target 'all-recursive' failed
[  326s] make[2]: *** [all-recursive] Error 1
[  326s] make[2]: Leaving directory '/usr/src/packages/BUILD'
[  326s] Makefile:362: recipe for target 'all' failed
[  326s] make[1]: *** [all] Error 2
[  326s] make[1]: Leaving directory '/usr/src/packages/BUILD'
[  326s] dh_auto_build: make -j1 returned exit code 2
[  326s] debian/rules:5: recipe for target 'binary' failed
[  326s] make: *** [binary] Error 2
[  326s] dpkg-buildpackage: error: fakeroot debian/rules binary subprocess returned exit status 2
[  326s] 
[  326s] morla3 failed "build osmo-gsm-manuals-dev_0.1.1.dsc" at Sat Jun  1 01:12:32 UTC 2019.
[  326s] 
[  326s] ### VM INTERACTION START ###
[  329s] [  312.321925] sysrq: SysRq : Power Off
[  329s] [  312.348941] reboot: Power down
[  329s] ### VM INTERACTION END ###
[  329s] 
[  329s] morla3 failed "build osmo-gsm-manuals-dev_0.1.1.dsc" at Sat Jun  1 01:12:36 UTC 2019.
[  329s] 

-- 
Configure notifications at https://build.opensuse.org/user/notifications
openSUSE Build Service (https://build.opensuse.org/)


More information about the gerrit-log mailing list