Build failure of network:osmocom:nightly/osmo-gsm-manuals in Debian_Testing/x86_64

OBS Notification admin at opensuse.org
Mon Jul 29 03:48:55 UTC 2019


Visit https://build.opensuse.org/package/live_build_log/network:osmocom:nightly/osmo-gsm-manuals/Debian_Testing/x86_64

Package network:osmocom:nightly/osmo-gsm-manuals failed to build in Debian_Testing/x86_64

Check out the package for editing:
  osc checkout network:osmocom:nightly osmo-gsm-manuals

Last lines of build log:
[  342s] asciidoc: cell-broadcast.adoc: line 46: reading: /usr/src/packages/BUILD/common/chapters/osmocom-cbs.msc
[  342s] asciidoc: cell-broadcast.adoc: line 45: evaluating: {counter2:target-number}
[  342s] asciidoc: cell-broadcast.adoc: line 45: evaluating: {set2:target:test-usermanual__53.png}
[  342s] asciidoc: osmocom-cbs.msc: line 12: filtering: "/usr/bin/python2" "./build/filter-wrapper.py" mscgen -o "/usr/src/packages/BUILD/tests/test-usermanual__53.png" -Tpng -
[  343s] asciidoc: include: /usr/src/packages/BUILD/common/chapters/port_numbers.adoc
[  343s] asciidoc: test-usermanual.adoc: line 31: reading: /usr/src/packages/BUILD/common/chapters/port_numbers.adoc
[  343s] asciidoc: port_numbers.adoc: line 50: evaluating: {counter:table-number}
[  343s] asciidoc: include: /usr/src/packages/BUILD/common/chapters/bts.adoc
[  343s] asciidoc: test-usermanual.adoc: line 32: reading: /usr/src/packages/BUILD/common/chapters/bts.adoc
[  343s] asciidoc: bts.adoc: line 305: evaluating: {counter:table-number}
[  343s] make[3]: *** [../build/Makefile.asciidoc.inc:69: test-usermanual.pdf] Error 1
[  343s] make[3]: Leaving directory '/usr/src/packages/BUILD/tests'
[  343s] make[2]: *** [Makefile:438: all-recursive] Error 1
[  343s] make[2]: Leaving directory '/usr/src/packages/BUILD'
[  343s] make[1]: *** [Makefile:362: all] Error 2
[  343s] make[1]: Leaving directory '/usr/src/packages/BUILD'
[  343s] dh_auto_build: make -j1 returned exit code 2
[  343s] make: *** [debian/rules:5: binary] Error 255
[  343s] dpkg-buildpackage: error: fakeroot debian/rules binary subprocess returned exit status 2
[  343s] 
[  343s] lamb28 failed "build osmo-gsm-manuals-dev_0.1.1.5.abad.dsc" at Mon Jul 29 03:48:50 UTC 2019.
[  343s] 
[  343s] ### VM INTERACTION START ###
[  347s] [  329.135464] sysrq: SysRq : Power Off
[  347s] [  329.140959] reboot: Power down
[  347s] ### VM INTERACTION END ###
[  347s] 
[  347s] lamb28 failed "build osmo-gsm-manuals-dev_0.1.1.5.abad.dsc" at Mon Jul 29 03:48:54 UTC 2019.
[  347s] 

-- 
Configure notifications at https://build.opensuse.org/user/notifications
openSUSE Build Service (https://build.opensuse.org/)


More information about the gerrit-log mailing list