Build failure of network:osmocom:nightly/osmo-python-tests in Debian_Unstable/x86_64

OBS Notification admin at opensuse.org
Sat Jul 20 02:36:05 UTC 2019


Visit https://build.opensuse.org/package/live_build_log/network:osmocom:nightly/osmo-python-tests/Debian_Unstable/x86_64

Package network:osmocom:nightly/osmo-python-tests failed to build in Debian_Unstable/x86_64

Check out the package for editing:
  osc checkout network:osmocom:nightly osmo-python-tests

Last lines of build log:
[   84s] rm -rf /usr/src/packages/BUILD/debian/python3-osmopy-utils/usr/lib
[   84s] make[1]: Leaving directory '/usr/src/packages/BUILD'
[   84s]    dh_installdocs
[   84s]    dh_installchangelogs
[   84s]    dh_python2
[   85s] I: dh_python2 tools:114: replacing shebang in debian/python2-osmopy-utils/usr/bin/osmodumpdoc.py
[   85s] I: dh_python2 tools:114: replacing shebang in debian/python2-osmopy-utils/usr/bin/osmotestvty.py
[   85s] I: dh_python2 tools:114: replacing shebang in debian/python2-osmopy-utils/usr/bin/osmotestconfig.py
[   85s]    dh_python3
[   85s]    debian/rules override_dh_installinit
[   85s] make[1]: Entering directory '/usr/src/packages/BUILD'
[   85s] # Install service file with different name than package name:
[   85s] # https://unix.stackexchange.com/questions/306234/is-it-possible-to-install-two-services-for-one-package-using-dh-installinit-how
[   85s] dh_installinit --name=osmo-ctrl2cgi
[   85s] dh_installinit: --name=osmo-ctrl2cgi option specified, but init script nor default file not found
[   85s] make[1]: *** [debian/rules:19: override_dh_installinit] Error 255
[   85s] make[1]: Leaving directory '/usr/src/packages/BUILD'
[   85s] make: *** [debian/rules:4: binary] Error 2
[   85s] dpkg-buildpackage: error: fakeroot debian/rules binary subprocess returned exit status 2
[   85s] 
[   85s] sheep83 failed "build osmo-python-tests_0.0.9.20190720.dsc" at Sat Jul 20 02:35:48 UTC 2019.
[   85s] 
[   85s] ### VM INTERACTION START ###
[   88s] [   77.736161] sysrq: SysRq : Power Off
[   88s] [   77.742165] reboot: Power down
[   88s] ### VM INTERACTION END ###
[   88s] 
[   88s] sheep83 failed "build osmo-python-tests_0.0.9.20190720.dsc" at Sat Jul 20 02:35:52 UTC 2019.
[   88s] 

-- 
Configure notifications at https://build.opensuse.org/user/notifications
openSUSE Build Service (https://build.opensuse.org/)


More information about the gerrit-log mailing list