Build failure of network:osmocom:nightly/osmo-python-tests in Debian_Unstable/x86_64

OBS Notification admin at opensuse.org
Fri Jul 19 02:40:13 UTC 2019


Visit https://build.opensuse.org/package/live_build_log/network:osmocom:nightly/osmo-python-tests/Debian_Unstable/x86_64

Package network:osmocom:nightly/osmo-python-tests failed to build in Debian_Unstable/x86_64

Check out the package for editing:
  osc checkout network:osmocom:nightly osmo-python-tests

Last lines of build log:
[  298s] rm -rf /usr/src/packages/BUILD/debian/python3-osmopy-utils/usr/lib
[  298s] make[1]: Leaving directory '/usr/src/packages/BUILD'
[  298s]    dh_installdocs
[  298s]    dh_installchangelogs
[  299s]    dh_python2
[  299s] I: dh_python2 tools:114: replacing shebang in debian/python2-osmopy-utils/usr/bin/osmotestconfig.py
[  299s] I: dh_python2 tools:114: replacing shebang in debian/python2-osmopy-utils/usr/bin/osmodumpdoc.py
[  299s] I: dh_python2 tools:114: replacing shebang in debian/python2-osmopy-utils/usr/bin/osmotestvty.py
[  299s]    dh_python3
[  299s]    debian/rules override_dh_installinit
[  299s] make[1]: Entering directory '/usr/src/packages/BUILD'
[  299s] # Install service file with different name than package name:
[  299s] # https://unix.stackexchange.com/questions/306234/is-it-possible-to-install-two-services-for-one-package-using-dh-installinit-how
[  299s] dh_installinit --name=osmo-ctrl2cgi
[  299s] dh_installinit: --name=osmo-ctrl2cgi option specified, but init script nor default file not found
[  299s] make[1]: *** [debian/rules:19: override_dh_installinit] Error 255
[  299s] make[1]: Leaving directory '/usr/src/packages/BUILD'
[  299s] make: *** [debian/rules:4: binary] Error 2
[  299s] dpkg-buildpackage: error: fakeroot debian/rules binary subprocess returned exit status 2
[  299s] 
[  299s] lamb51 failed "build osmo-python-tests_0.0.9.20190719.dsc" at Fri Jul 19 02:39:55 UTC 2019.
[  299s] 
[  299s] ### VM INTERACTION START ###
[  302s] [  264.563381] sysrq: SysRq : Power Off
[  302s] [  264.591706] reboot: Power down
[  302s] ### VM INTERACTION END ###
[  302s] 
[  302s] lamb51 failed "build osmo-python-tests_0.0.9.20190719.dsc" at Fri Jul 19 02:39:58 UTC 2019.
[  302s] 

-- 
Configure notifications at https://build.opensuse.org/user/notifications
openSUSE Build Service (https://build.opensuse.org/)


More information about the gerrit-log mailing list