Build failure of network:osmocom:nightly/osmo-python-tests in Debian_Unstable/x86_64

OBS Notification admin at opensuse.org
Wed Jul 17 14:54:51 UTC 2019


Visit https://build.opensuse.org/package/live_build_log/network:osmocom:nightly/osmo-python-tests/Debian_Unstable/x86_64

Package network:osmocom:nightly/osmo-python-tests failed to build in Debian_Unstable/x86_64

Check out the package for editing:
  osc checkout network:osmocom:nightly osmo-python-tests

Last lines of build log:
[  209s] rm -rf /usr/src/packages/BUILD/debian/python3-osmopy-utils/usr/lib
[  209s] make[1]: Leaving directory '/usr/src/packages/BUILD'
[  209s]    dh_installdocs
[  209s]    dh_installchangelogs
[  209s]    dh_python2
[  209s] I: dh_python2 tools:114: replacing shebang in debian/python2-osmopy-utils/usr/bin/osmotestvty.py
[  209s] I: dh_python2 tools:114: replacing shebang in debian/python2-osmopy-utils/usr/bin/osmotestconfig.py
[  209s] I: dh_python2 tools:114: replacing shebang in debian/python2-osmopy-utils/usr/bin/osmodumpdoc.py
[  209s]    dh_python3
[  209s]    debian/rules override_dh_installinit
[  209s] make[1]: Entering directory '/usr/src/packages/BUILD'
[  209s] # Install service file with different name than package name:
[  209s] # https://unix.stackexchange.com/questions/306234/is-it-possible-to-install-two-services-for-one-package-using-dh-installinit-how
[  209s] dh_installinit --name=osmo-ctrl2cgi
[  209s] dh_installinit: --name=osmo-ctrl2cgi option specified, but init script nor default file not found
[  209s] make[1]: *** [debian/rules:19: override_dh_installinit] Error 255
[  209s] make[1]: Leaving directory '/usr/src/packages/BUILD'
[  209s] make: *** [debian/rules:4: binary] Error 2
[  209s] dpkg-buildpackage: error: fakeroot debian/rules binary subprocess returned exit status 2
[  209s] 
[  209s] lamb56 failed "build osmo-python-tests_0.0.9.20190717.dsc" at Wed Jul 17 14:54:33 UTC 2019.
[  209s] 
[  209s] ### VM INTERACTION START ###
[  213s] [  194.914009] sysrq: SysRq : Power Off
[  213s] [  194.919603] reboot: Power down
[  213s] ### VM INTERACTION END ###
[  213s] 
[  213s] lamb56 failed "build osmo-python-tests_0.0.9.20190717.dsc" at Wed Jul 17 14:54:38 UTC 2019.
[  213s] 

-- 
Configure notifications at https://build.opensuse.org/user/notifications
openSUSE Build Service (https://build.opensuse.org/)


More information about the gerrit-log mailing list