Build failure of network:osmocom:nightly/libosmo-netif in xUbuntu_18.04/x86_64

OBS Notification admin at opensuse.org
Tue Jul 16 02:43:27 UTC 2019


Visit https://build.opensuse.org/package/live_build_log/network:osmocom:nightly/libosmo-netif/xUbuntu_18.04/x86_64

Package network:osmocom:nightly/libosmo-netif failed to build in xUbuntu_18.04/x86_64

Check out the package for editing:
  osc checkout network:osmocom:nightly libosmo-netif

Last lines of build log:
[  140s] | #define HAVE_DLFCN_H 1
[  140s] | #define LT_OBJDIR ".libs/"
[  140s] | #define STDC_HEADERS 1
[  140s] | #define HAVE_EXECINFO_H 1
[  140s] | #define HAVE_SYS_SELECT_H 1
[  140s] | #define HAVE_SYS_SOCKET_H 1
[  140s] | #define HAVE_SYSLOG_H 1
[  140s] | #define HAVE_CTYPE_H 1
[  140s] | #define HAVE_LIBSCTP 1
[  140s] | #define HAVE_PCAP_H 1
[  140s] | 
[  140s] | configure: exit 0
[  140s] 
[  140s] debian/rules:27: recipe for target 'override_dh_auto_test' failed
[  140s] make[1]: *** [override_dh_auto_test] Error 1
[  140s] make[1]: Leaving directory '/usr/src/packages/BUILD'
[  140s] debian/rules:13: recipe for target 'build' failed
[  140s] make: *** [build] Error 2
[  140s] dpkg-buildpackage: error: debian/rules build subprocess returned exit status 2
[  140s] 
[  140s] lamb62 failed "build libosmo-netif_0.5.0.2.6563.dsc" at Tue Jul 16 02:43:14 UTC 2019.
[  140s] 
[  140s] ### VM INTERACTION START ###
[  143s] [  130.184931] sysrq: SysRq : Power Off
[  143s] [  130.192826] reboot: Power down
[  143s] ### VM INTERACTION END ###
[  143s] 
[  143s] lamb62 failed "build libosmo-netif_0.5.0.2.6563.dsc" at Tue Jul 16 02:43:18 UTC 2019.
[  143s] 

-- 
Configure notifications at https://build.opensuse.org/user/notifications
openSUSE Build Service (https://build.opensuse.org/)


More information about the gerrit-log mailing list