Build failure of network:osmocom:nightly/osmo-python-tests in Debian_Unstable/x86_64

OBS Notification admin at opensuse.org
Mon Jul 15 10:06:17 UTC 2019


Visit https://build.opensuse.org/package/live_build_log/network:osmocom:nightly/osmo-python-tests/Debian_Unstable/x86_64

Package network:osmocom:nightly/osmo-python-tests failed to build in Debian_Unstable/x86_64

Check out the package for editing:
  osc checkout network:osmocom:nightly osmo-python-tests

Last lines of build log:
[  109s] rm -rf /usr/src/packages/BUILD/debian/python3-osmopy-utils/usr/lib
[  109s] make[1]: Leaving directory '/usr/src/packages/BUILD'
[  109s]    dh_installdocs
[  109s]    dh_installchangelogs
[  109s]    dh_python2
[  109s] I: dh_python2 tools:114: replacing shebang in debian/python2-osmopy-utils/usr/bin/osmotestconfig.py
[  109s] I: dh_python2 tools:114: replacing shebang in debian/python2-osmopy-utils/usr/bin/osmodumpdoc.py
[  109s] I: dh_python2 tools:114: replacing shebang in debian/python2-osmopy-utils/usr/bin/osmotestvty.py
[  109s]    dh_python3
[  109s]    debian/rules override_dh_installinit
[  109s] make[1]: Entering directory '/usr/src/packages/BUILD'
[  109s] # Install service file with different name than package name:
[  109s] # https://unix.stackexchange.com/questions/306234/is-it-possible-to-install-two-services-for-one-package-using-dh-installinit-how
[  109s] dh_installinit --name=osmo-ctrl2cgi
[  110s] dh_installinit: --name=osmo-ctrl2cgi option specified, but init script not found
[  110s] make[1]: *** [debian/rules:19: override_dh_installinit] Error 255
[  110s] make[1]: Leaving directory '/usr/src/packages/BUILD'
[  110s] make: *** [debian/rules:4: binary] Error 2
[  110s] dpkg-buildpackage: error: fakeroot debian/rules binary subprocess returned exit status 2
[  110s] 
[  110s] lamb59 failed "build osmo-python-tests_0.0.9.20190715.dsc" at Mon Jul 15 10:06:01 UTC 2019.
[  110s] 
[  110s] ### VM INTERACTION START ###
[  113s] [   97.833429] sysrq: SysRq : Power Off
[  113s] [   97.838960] reboot: Power down
[  113s] ### VM INTERACTION END ###
[  113s] 
[  113s] lamb59 failed "build osmo-python-tests_0.0.9.20190715.dsc" at Mon Jul 15 10:06:05 UTC 2019.
[  113s] 

-- 
Configure notifications at https://build.opensuse.org/user/notifications
openSUSE Build Service (https://build.opensuse.org/)


More information about the gerrit-log mailing list