Build failure of network:osmocom:nightly/osmo-python-tests in Debian_Unstable/x86_64

OBS Notification admin at opensuse.org
Mon Jul 15 02:36:16 UTC 2019


Visit https://build.opensuse.org/package/live_build_log/network:osmocom:nightly/osmo-python-tests/Debian_Unstable/x86_64

Package network:osmocom:nightly/osmo-python-tests failed to build in Debian_Unstable/x86_64

Check out the package for editing:
  osc checkout network:osmocom:nightly osmo-python-tests

Last lines of build log:
[   59s] rm -rf /usr/src/packages/BUILD/debian/python3-osmopy-utils/usr/lib
[   59s] make[1]: Leaving directory '/usr/src/packages/BUILD'
[   59s]    dh_installdocs
[   59s]    dh_installchangelogs
[   59s]    dh_python2
[   59s] I: dh_python2 tools:114: replacing shebang in debian/python2-osmopy-utils/usr/bin/osmodumpdoc.py
[   59s] I: dh_python2 tools:114: replacing shebang in debian/python2-osmopy-utils/usr/bin/osmotestvty.py
[   59s] I: dh_python2 tools:114: replacing shebang in debian/python2-osmopy-utils/usr/bin/osmotestconfig.py
[   59s]    dh_python3
[   59s]    debian/rules override_dh_installinit
[   59s] make[1]: Entering directory '/usr/src/packages/BUILD'
[   59s] # Install service file with different name than package name:
[   59s] # https://unix.stackexchange.com/questions/306234/is-it-possible-to-install-two-services-for-one-package-using-dh-installinit-how
[   59s] dh_installinit --name=osmo-ctrl2cgi
[   59s] dh_installinit: --name=osmo-ctrl2cgi option specified, but init script not found
[   59s] make[1]: *** [debian/rules:19: override_dh_installinit] Error 255
[   59s] make[1]: Leaving directory '/usr/src/packages/BUILD'
[   59s] make: *** [debian/rules:4: binary] Error 2
[   59s] dpkg-buildpackage: error: fakeroot debian/rules binary subprocess returned exit status 2
[   59s] 
[   59s] build83 failed "build osmo-python-tests_0.0.9.20190715.dsc" at Mon Jul 15 02:36:12 UTC 2019.
[   59s] 
[   59s] ### VM INTERACTION START ###
[   62s] [   53.035478] sysrq: SysRq : Power Off
[   62s] [   53.037182] reboot: Power down
[   62s] ### VM INTERACTION END ###
[   62s] 
[   62s] build83 failed "build osmo-python-tests_0.0.9.20190715.dsc" at Mon Jul 15 02:36:15 UTC 2019.
[   62s] 

-- 
Configure notifications at https://build.opensuse.org/user/notifications
openSUSE Build Service (https://build.opensuse.org/)


More information about the gerrit-log mailing list