Build failure of network:osmocom:nightly/osmo-python-tests in Debian_Unstable/x86_64

OBS Notification admin at opensuse.org
Sun Jul 14 15:43:15 UTC 2019


Visit https://build.opensuse.org/package/live_build_log/network:osmocom:nightly/osmo-python-tests/Debian_Unstable/x86_64

Package network:osmocom:nightly/osmo-python-tests failed to build in Debian_Unstable/x86_64

Check out the package for editing:
  osc checkout network:osmocom:nightly osmo-python-tests

Last lines of build log:
[  105s] rm -rf /usr/src/packages/BUILD/debian/python3-osmopy-utils/usr/lib
[  105s] make[1]: Leaving directory '/usr/src/packages/BUILD'
[  105s]    dh_installdocs
[  105s]    dh_installchangelogs
[  105s]    dh_python2
[  106s] I: dh_python2 tools:114: replacing shebang in debian/python2-osmopy-utils/usr/bin/osmodumpdoc.py
[  106s] I: dh_python2 tools:114: replacing shebang in debian/python2-osmopy-utils/usr/bin/osmotestvty.py
[  106s] I: dh_python2 tools:114: replacing shebang in debian/python2-osmopy-utils/usr/bin/osmotestconfig.py
[  106s]    dh_python3
[  106s]    debian/rules override_dh_installinit
[  106s] make[1]: Entering directory '/usr/src/packages/BUILD'
[  106s] # Install service file with different name than package name:
[  106s] # https://unix.stackexchange.com/questions/306234/is-it-possible-to-install-two-services-for-one-package-using-dh-installinit-how
[  106s] dh_installinit --name=osmo-ctrl2cgi
[  106s] dh_installinit: --name=osmo-ctrl2cgi option specified, but init script not found
[  106s] make[1]: *** [debian/rules:19: override_dh_installinit] Error 255
[  106s] make[1]: Leaving directory '/usr/src/packages/BUILD'
[  106s] make: *** [debian/rules:4: binary] Error 2
[  106s] dpkg-buildpackage: error: fakeroot debian/rules binary subprocess returned exit status 2
[  106s] 
[  106s] lamb13 failed "build osmo-python-tests_0.0.9.20190714.dsc" at Sun Jul 14 15:43:07 UTC 2019.
[  106s] 
[  106s] ### VM INTERACTION START ###
[  109s] [   95.379719] sysrq: SysRq : Power Off
[  109s] [   95.387221] reboot: Power down
[  109s] ### VM INTERACTION END ###
[  109s] 
[  109s] lamb13 failed "build osmo-python-tests_0.0.9.20190714.dsc" at Sun Jul 14 15:43:11 UTC 2019.
[  109s] 

-- 
Configure notifications at https://build.opensuse.org/user/notifications
openSUSE Build Service (https://build.opensuse.org/)


More information about the gerrit-log mailing list