Build failure of network:osmocom:latest/openbsc in Debian_10/i586

OBS Notification admin at opensuse.org
Sat Jul 13 16:40:09 UTC 2019


Visit https://build.opensuse.org/package/live_build_log/network:osmocom:latest/openbsc/Debian_10/i586

Package network:osmocom:latest/openbsc failed to build in Debian_10/i586

Check out the package for editing:
  osc checkout network:osmocom:latest openbsc

Last lines of build log:
[   99s] | #define HAVE_MEMORY_H 1
[   99s] | #define HAVE_STRINGS_H 1
[   99s] | #define HAVE_INTTYPES_H 1
[   99s] | #define HAVE_STDINT_H 1
[   99s] | #define HAVE_UNISTD_H 1
[   99s] | #define HAVE_DLFCN_H 1
[   99s] | #define LT_OBJDIR ".libs/"
[   99s] | #define BUILD_SMPP 1
[   99s] | #define STDC_HEADERS 1
[   99s] | #define HAVE_DBI_DBD_H 1
[   99s] | #define HAVE_PCAP_PCAP_H 1
[   99s] | #define HAVE_TM_GMTOFF_IN_TM 1
[   99s] | 
[   99s] | configure: exit 0
[   99s] 
[   99s] make[1]: *** [debian/rules:30: override_dh_auto_test] Error 1
[   99s] make[1]: Leaving directory '/usr/src/packages/BUILD'
[   99s] make: *** [debian/rules:13: build] Error 2
[   99s] dpkg-buildpackage: error: debian/rules build subprocess returned exit status 2
[   99s] 
[   99s] build73 failed "build openbsc_1.2.0.dsc" at Sat Jul 13 16:39:59 UTC 2019.
[   99s] 
[   99s] ### VM INTERACTION START ###
[  102s] [   93.097907] sysrq: SysRq : Power Off
[  102s] [   93.100006] reboot: Power down
[  102s] ### VM INTERACTION END ###
[  102s] 
[  102s] build73 failed "build openbsc_1.2.0.dsc" at Sat Jul 13 16:40:03 UTC 2019.
[  102s] 

-- 
Configure notifications at https://build.opensuse.org/user/notifications
openSUSE Build Service (https://build.opensuse.org/)


More information about the gerrit-log mailing list