Build failure of network:osmocom:nightly/libosmocore in Raspbian_9.0/armv7l

OBS Notification admin at opensuse.org
Fri Jul 12 02:43:08 UTC 2019


Visit https://build.opensuse.org/package/live_build_log/network:osmocom:nightly/libosmocore/Raspbian_9.0/armv7l

Package network:osmocom:nightly/libosmocore failed to build in Raspbian_9.0/armv7l

Check out the package for editing:
  osc checkout network:osmocom:nightly libosmocore

Last lines of build log:
[  671s] | This file was extended by libosmocore config.status 1.1.0.79-a3dec, which was
[  671s] | generated by GNU Autoconf 2.69.  Invocation command line was
[  671s] | 
[  671s] |   CONFIG_FILES    = 
[  671s] |   CONFIG_HEADERS  = 
[  671s] |   CONFIG_LINKS    = 
[  671s] |   CONFIG_COMMANDS = 
[  671s] |   $ ./config.status Doxyfile.core
[  671s] | 
[  671s] | on armbuild04
[  671s] | 
[  671s] | config.status:1200: creating Doxyfile.core
[  671s] 
[  671s] debian/rules:26: recipe for target 'override_dh_auto_test' failed
[  671s] make[1]: *** [override_dh_auto_test] Error 1
[  671s] make[1]: Leaving directory '/usr/src/packages/BUILD'
[  671s] debian/rules:15: recipe for target 'build' failed
[  671s] make: *** [build] Error 2
[  671s] dpkg-buildpackage: error: debian/rules build gave error exit status 2
[  671s] 
[  671s] armbuild04 failed "build libosmocore_1.1.0.79.a3dec.dsc" at Fri Jul 12 02:43:02 UTC 2019.
[  671s] 
[  671s] ### VM INTERACTION START ###
[  673s] [  619.144091] sysrq: SysRq : Power Off
[  673s] [  619.147601] reboot: Power down
[  673s] ### VM INTERACTION END ###
[  673s] 
[  673s] armbuild04 failed "build libosmocore_1.1.0.79.a3dec.dsc" at Fri Jul 12 02:43:06 UTC 2019.
[  673s] 

-- 
Configure notifications at https://build.opensuse.org/user/notifications
openSUSE Build Service (https://build.opensuse.org/)


More information about the gerrit-log mailing list