Build failure of network:osmocom:nightly/osmo-remsim in Debian_Unstable/x86_64

OBS Notification admin at opensuse.org
Tue Jul 9 21:19:45 UTC 2019


Visit https://build.opensuse.org/package/live_build_log/network:osmocom:nightly/osmo-remsim/Debian_Unstable/x86_64

Package network:osmocom:nightly/osmo-remsim failed to build in Debian_Unstable/x86_64

Check out the package for editing:
  osc checkout network:osmocom:nightly osmo-remsim

Last lines of build log:
[  178s] /bin/bash ../libtool  --tag=CC   --mode=compile gcc -DPACKAGE_NAME=\"osmo-remsim\" -DPACKAGE_TARNAME=\"osmo-remsim\" -DPACKAGE_VERSION=\"0.1.0.19-293c\" -DPACKAGE_STRING=\"osmo-remsim\ 0.1.0.19-293c\" -DPACKAGE_BUGREPORT=\"simtrace at lists.osmocom.org\" -DPACKAGE_URL=\"\" -DSTDC_HEADERS=1 -DHAVE_SYS_TYPES_H=1 -DHAVE_SYS_STAT_H=1 -DHAVE_STDLIB_H=1 -DHAVE_STRING_H=1 -DHAVE_MEMORY_H=1 -DHAVE_STRINGS_H=1 -DHAVE_INTTYPES_H=1 -DHAVE_STDINT_H=1 -DHAVE_UNISTD_H=1 -DHAVE_DLFCN_H=1 -DLT_OBJDIR=\".libs/\" -DPACKAGE=\"osmo-remsim\" -DVERSION=\"0.1.0.19-293c\" -DHAVE_CSV_H=1 -DBUILD_SERVER=1 -DBUILD_BANKD=1 -DSTDC_HEADERS=1 -I.   -Wdate-time -D_FORTIFY_SOURCE=2 -Wall -Wall -I../include -I../include -I/usr/include/ -I/usr/include/ -I/usr/include/ -pthread -I/usr/include/PCSC -I/usr/include/libusb-1.0 -I/usr/include/ -I../include/osmocom/rspro -g -O2 -fdebug-prefix-map=/usr/src/packages/BUILD=. -fstack-protector-strong -Wformat -Werror=format-security -Wall -c -o rspro_util.lo rspro_util.c
[  179s] libtool: compile:  gcc -DPACKAGE_NAME=\"osmo-remsim\" -DPACKAGE_TARNAME=\"osmo-remsim\" -DPACKAGE_VERSION=\"0.1.0.19-293c\" "-DPACKAGE_STRING=\"osmo-remsim 0.1.0.19-293c\"" -DPACKAGE_BUGREPORT=\"simtrace at lists.osmocom.org\" -DPACKAGE_URL=\"\" -DSTDC_HEADERS=1 -DHAVE_SYS_TYPES_H=1 -DHAVE_SYS_STAT_H=1 -DHAVE_STDLIB_H=1 -DHAVE_STRING_H=1 -DHAVE_MEMORY_H=1 -DHAVE_STRINGS_H=1 -DHAVE_INTTYPES_H=1 -DHAVE_STDINT_H=1 -DHAVE_UNISTD_H=1 -DHAVE_DLFCN_H=1 -DLT_OBJDIR=\".libs/\" -DPACKAGE=\"osmo-remsim\" -DVERSION=\"0.1.0.19-293c\" -DHAVE_CSV_H=1 -DBUILD_SERVER=1 -DBUILD_BANKD=1 -DSTDC_HEADERS=1 -I. -Wdate-time -D_FORTIFY_SOURCE=2 -Wall -Wall -I../include -I../include -I/usr/include/ -I/usr/include/ -I/usr/include/ -pthread -I/usr/include/PCSC -I/usr/include/libusb-1.0 -I/usr/include/ -I../include/osmocom/rspro -g -O2 -fdebug-prefix-map=/usr/src/packages/BUILD=. -fstack-protector-strong -Wformat -Werror=format-security -Wall -c rspro_util.c  -fPIC -DPIC -o .libs/rspro_util.o
[  179s] rspro_util.c: In function 'rspro_gen_TpduCard2Modem':
[  179s] rspro_util.c:384:2: error: expected ';' before 'pdu'
[  179s]   pdu->msg.choice.tpduCardToModem.toClientSlot = *client;
[  179s]   ^~~
[  179s] make[5]: *** [Makefile:614: rspro_util.lo] Error 1
[  179s] make[5]: Leaving directory '/usr/src/packages/BUILD/src'
[  179s] make[4]: *** [Makefile:771: ../../src/libosmo-rspro.la] Error 2
[  179s] make[4]: Leaving directory '/usr/src/packages/BUILD/src/bankd'
[  179s] make[3]: *** [Makefile:671: all-recursive] Error 1
[  179s] make[3]: Leaving directory '/usr/src/packages/BUILD/src'
[  179s] make[2]: *** [Makefile:460: all-recursive] Error 1
[  179s] make[2]: Leaving directory '/usr/src/packages/BUILD'
[  179s] make[1]: *** [Makefile:384: all] Error 2
[  179s] make[1]: Leaving directory '/usr/src/packages/BUILD'
[  179s] dh_auto_build: make -j1 returned exit code 2
[  179s] make: *** [debian/rules:12: build] Error 2
[  179s] dpkg-buildpackage: error: debian/rules build subprocess returned exit status 2
[  179s] 
[  179s] lamb56 failed "build osmo-remsim_0.1.0.19.293c.dsc" at Tue Jul  9 21:19:34 UTC 2019.
[  179s] 
[  179s] ### VM INTERACTION START ###
[  182s] [  167.116196] sysrq: SysRq : Power Off
[  182s] [  167.123705] reboot: Power down
[  182s] ### VM INTERACTION END ###
[  182s] 
[  182s] lamb56 failed "build osmo-remsim_0.1.0.19.293c.dsc" at Tue Jul  9 21:19:38 UTC 2019.
[  182s] 

-- 
Configure notifications at https://build.opensuse.org/user/notifications
openSUSE Build Service (https://build.opensuse.org/)


More information about the gerrit-log mailing list