Build failure of network:osmocom:latest/orcania in Debian_Unstable/x86_64

OBS Notification admin at opensuse.org
Tue Jul 9 03:36:59 UTC 2019


Visit https://build.opensuse.org/package/live_build_log/network:osmocom:latest/orcania/Debian_Unstable/x86_64

Package network:osmocom:latest/orcania failed to build in Debian_Unstable/x86_64

Check out the package for editing:
  osc checkout network:osmocom:latest orcania

Last lines of build log:
[   21s] objdump: /boot/vmlinuz: warning: ignoring section flag IMAGE_SCN_MEM_NOT_PAGED in section .bss
[   30s] booting kvm...
[   30s] ### VM INTERACTION START ###
[   30s] /usr/bin/qemu-kvm -nodefaults -no-reboot -nographic -vga none -cpu host,-smap -object rng-random,filename=/dev/random,id=rng0 -device virtio-rng-pci,rng=rng0 -runas qemu -net none -kernel /boot/vmlinuz -initrd /boot/initrd -append root=/dev/sda rootfstype=ext3 rootflags=data=writeback,nobarrier,commit=150,noatime ext4.allow_unsupported=1 kpti=off pti=off spectre_v2=off panic=1 quiet no-kvmclock elevator=noop nmi_watchdog=0 rw rd.driver.pre=binfmt_misc console=ttyS0 init=/.build/build -m 6000 -drive file=/var/cache/obs/worker/root_2/root,format=raw,if=none,id=disk,cache=unsafe -device ide-hd,drive=disk,serial=0 -drive file=/var/cache/obs/worker/root_2/swap,format=raw,if=none,id=swap,cache=unsafe -device ide-hd,drive=swap,serial=1 -serial stdio -chardev socket,id=monitor,server,nowait,path=/var/cache/obs/worker/root_2/root.qemu/monitor -mon chardev=monitor,mode=readline -smp 8
[   31s] c[?7lSeaBIOS (version rel-1.12.0-0-ga698c89-prebuilt.qemu.org)
[   37s] Booting from ROM..c[?7l### VM INTERACTION END ###
[   37s] 2nd stage started in virtual machine
[   39s] machine type: x86_64
[   39s] [    7.413700] sysrq: SysRq : Changing Loglevel
[   39s] [    7.415556] sysrq: Loglevel set to 4
[   39s] Linux version: 4.12.14-1.g2114e94-default #1 SMP Mon Jun 3 08:29:36 UTC 2019 (2114e94)
[   39s] Increasing log level from now on...
[   39s] mount: error while loading shared libraries: libpcre2-8.so.0: cannot open shared object file: No such file or directory
[   39s] mkdir: error while loading shared libraries: libpcre2-8.so.0: cannot open shared object file: No such file or directory
[   39s] mkdir: error while loading shared libraries: libpcre2-8.so.0: cannot open shared object file: No such file or directory
[   39s] mount: error while loading shared libraries: libpcre2-8.so.0: cannot open shared object file: No such file or directory
[   39s] mount: error while loading shared libraries: libpcre2-8.so.0: cannot open shared object file: No such file or directory
[   39s] mkswap: error while loading shared libraries: libpcre2-8.so.0: cannot open shared object file: No such file or directory
[   40s] swapon: error while loading shared libraries: libpcre2-8.so.0: cannot open shared object file: No such file or directory
[   40s] 
[   40s]  failed "build orcania_1.2.9-5.dsc" at Tue Jul  9 03:36:47 UTC 2019.
[   40s] 
[   40s] ### VM INTERACTION START ###
[   43s] [   10.851789] sysrq: SysRq : Power Off
[   43s] [   10.857702] reboot: Power down
[   43s] ### VM INTERACTION END ###
[   43s] 
[   43s] cloud133 failed "build orcania_1.2.9-5.dsc" at Tue Jul  9 03:36:52 UTC 2019.
[   43s] 

-- 
Configure notifications at https://build.opensuse.org/user/notifications
openSUSE Build Service (https://build.opensuse.org/)


More information about the gerrit-log mailing list