Build failure of network:osmocom:latest/eclipse-titan in Debian_Unstable/x86_64

OBS Notification admin at opensuse.org
Tue Jul 9 03:35:33 UTC 2019


Visit https://build.opensuse.org/package/live_build_log/network:osmocom:latest/eclipse-titan/Debian_Unstable/x86_64

Package network:osmocom:latest/eclipse-titan failed to build in Debian_Unstable/x86_64

Check out the package for editing:
  osc checkout network:osmocom:latest eclipse-titan

Last lines of build log:
[   12s] objdump: /boot/vmlinuz: warning: ignoring section flag IMAGE_SCN_MEM_NOT_PAGED in section .bss
[   13s] booting kvm...
[   13s] ### VM INTERACTION START ###
[   13s] /usr/bin/qemu-kvm -nodefaults -no-reboot -nographic -vga none -cpu host,-smap -object rng-random,filename=/dev/random,id=rng0 -device virtio-rng-pci,rng=rng0 -runas qemu -net none -kernel /boot/vmlinuz -initrd /boot/initrd -append root=/dev/sda rootfstype=ext3 rootflags=data=writeback,nobarrier,commit=150,noatime ext4.allow_unsupported=1 kpti=off pti=off spectre_v2=off panic=1 quiet no-kvmclock elevator=noop nmi_watchdog=0 rw rd.driver.pre=binfmt_misc console=ttyS0 init=/.build/build -m 8192 -drive file=/var/cache/obs/worker/root_5/root,format=raw,if=none,id=disk,cache=unsafe -device ide-hd,drive=disk,serial=0 -drive file=/var/cache/obs/worker/root_5/swap,format=raw,if=none,id=swap,cache=unsafe -device ide-hd,drive=swap,serial=1 -serial stdio -chardev socket,id=monitor,server,nowait,path=/var/cache/obs/worker/root_5/root.qemu/monitor -mon chardev=monitor,mode=readline -smp 8
[   14s] c[?7lSeaBIOS (version rel-1.12.0-0-ga698c89-prebuilt.qemu.org)
[   19s] Booting from ROM..c[?7l### VM INTERACTION END ###
[   19s] 2nd stage started in virtual machine
[   19s] machine type: x86_64
[   19s] Linux version: 4[    4.317561] sysrq: SysRq : Changing Loglevel
[   19s] .12.14-1.g2114e9[    4.318795] sysrq: Loglevel set to 4
[   19s] 4-default #1 SMP Mon Jun 3 08:29:36 UTC 2019 (2114e94)
[   19s] Increasing log level from now on...
[   19s] mount: error while loading shared libraries: libpcre2-8.so.0: cannot open shared object file: No such file or directory
[   19s] mkdir: error while loading shared libraries: libpcre2-8.so.0: cannot open shared object file: No such file or directory
[   19s] mkdir: error while loading shared libraries: libpcre2-8.so.0: cannot open shared object file: No such file or directory
[   19s] mount: error while loading shared libraries: libpcre2-8.so.0: cannot open shared object file: No such file or directory
[   19s] mount: error while loading shared libraries: libpcre2-8.so.0: cannot open shared object file: No such file or directory
[   19s] mkswap: error while loading shared libraries: libpcre2-8.so.0: cannot open shared object file: No such file or directory
[   19s] swapon: error while loading shared libraries: libpcre2-8.so.0: cannot open shared object file: No such file or directory
[   19s] 
[   19s]  failed "build eclipse-titan_6.5.0-1.dsc" at Tue Jul  9 03:35:18 UTC 2019.
[   19s] 
[   19s] ### VM INTERACTION START ###
[   22s] [    7.393301] sysrq: SysRq : Power Off
[   22s] [    7.402841] reboot: Power down
[   22s] ### VM INTERACTION END ###
[   22s] 
[   22s] lamb28 failed "build eclipse-titan_6.5.0-1.dsc" at Tue Jul  9 03:35:22 UTC 2019.
[   22s] 

-- 
Configure notifications at https://build.opensuse.org/user/notifications
openSUSE Build Service (https://build.opensuse.org/)


More information about the gerrit-log mailing list